program: Gaussian 09
title: 000293201
version: EM64L-G09RevD.01
frameworkgroup: C1[X(C14H10Cl3N3O2)]
method: RPBEPBE
basis: SDD
operation: Freq
keyword: #p
keyword: freq=noraman
keyword: PBEPBE/SDD
title: #p freq=noraman PBEPBE/SDD
converged: YES YES NO NO
title: Mulliken charges:
elementType: Cl Cl Cl O O N N N C C C C C C C C C C C C C C H H H H H H H H H H
charge: -0.016787 -0.034277 -0.037019 -0.200864 -0.199539 -0.021349 -0.016766 0.026055 0.584986 -0.592561 0.583490 -0.595192 -0.294145 -0.319119 0.400198 -0.350483 -0.375274 -0.294389 -0.349297 -0.198604 -0.222778 -0.095362 0.238538 0.252317 0.235923 0.251114 0.250030 0.311566 0.290978 0.242590 0.283936 0.262084
chargesum: 0.00000
title: Mulliken charges with hydrogens summed into heavy atoms:
elementType: Cl Cl Cl O O N N N C C C C C C C C C C C C C C
charge: -0.016787 -0.034277 -0.037019 -0.200864 -0.199539 -0.021349 -0.016766 0.026055 0.584986 -0.101707 0.583490 -0.108155 -0.294145 -0.069089 0.400198 -0.038917 -0.084295 -0.294389 -0.106706 0.085332 0.039305 -0.095362
polarizability: 3.07941928e+02 6.69747213e+00 2.22337189e+02 5.87808747e+01 -7.08723618e+00 1.33236929e+02
1716.lowfreq: -3.5453 0.0004 0.0008 0.0015 0.4905 6.8999 10.9228 13.9478 23.6345
frequency: 9.1339 13.8528 23.6192 39.6090 42.4341 57.6733 97.5694 116.0857 164.1638 164.8864 167.6165 177.8964 190.5991 220.7715 236.7869 256.7413 300.6059 302.8539 334.2004 339.4514 371.7230 409.1993 422.3073 435.8652 436.7618 447.9003 472.6355 510.3449 526.2652 551.6022 582.3865 633.1372 645.8139 680.7942 692.1586 695.8331 724.7115 729.6540 770.2892 814.1273 824.7370 846.8274 850.7413 867.6450 892.5555 918.3683 923.1217 952.6396 970.4813 985.6011 1022.1331 1028.6504 1031.9051 1085.5694 1100.3261 1135.4157 1142.8152 1179.1132 1183.8096 1207.4412 1213.2754 1221.3962 1263.2776 1265.6193 1302.7920 1319.0116 1364.3462 1366.6759 1376.9193 1392.1239 1403.2625 1444.1332 1449.1138 1456.3968 1462.2026 1467.6960 1570.1460 1585.4239 1593.4456 1599.9836 2990.8195 2996.9111 3062.4593 3069.0301 3141.5938 3149.6140 3178.6337 3183.9024 3189.3214 3191.0245
redmass: 13.7216 13.4606 11.5668 9.2031 9.7953 14.2620 7.4702 7.5355 6.2317 6.2449 12.1236 14.7299 11.2828 7.7103 6.9812 5.8502 4.1467 4.1341 8.6095 7.1001 9.3462 4.9915 3.9967 4.4966 3.7847 3.9193 5.3307 5.3328 5.2587 4.5879 3.2350 6.3752 6.5882 6.9268 5.8400 6.3731 4.5415 4.8998 5.8658 2.2104 2.2015 1.6804 5.2890 1.4017 2.8718 3.1224 1.8330 1.3996 1.7421 1.3766 2.7037 3.2093 2.7543 2.6704 3.2977 1.3501 1.3849 1.2157 1.2952 3.4525 2.5362 3.3823 1.3216 1.3371 1.3001 1.3701 5.7132 4.0719 5.4928 7.5379 5.7843 1.3597 1.2543 2.5537 2.5596 2.7401 7.8774 8.4666 7.5223 7.3207 1.0569 1.0567 1.1050 1.1056 1.0902 1.0909 1.0957 1.0938 1.0934 1.0948
irintensity: 0.0174 0.2238 0.0143 0.2513 1.0185 0.3547 0.8836 0.2337 0.1889 0.3443 1.4560 1.0497 3.2350 1.1772 2.4615 0.7219 3.2344 6.1543 2.8438 8.0963 4.1116 5.0121 16.7910 0.6311 2.3189 4.5139 11.3709 0.9689 0.5525 11.4840 8.0450 4.2387 2.6655 34.7384 9.8512 23.3356 8.6656 26.0797 12.1410 51.4094 25.1085 30.9166 13.1423 20.5253 6.3027 12.2769 39.7742 1.5240 2.8561 1.0390 8.8120 16.2228 10.3218 31.5231 38.6177 13.7812 4.0416 5.4278 1.2750 204.4515 70.8425 132.6066 1.3825 3.0051 2.9141 5.0157 38.5712 10.5364 7.8209 21.4415 99.2864 18.6720 9.9092 26.6693 100.0734 2.8309 23.1133 6.1644 55.1952 18.6950 25.4207 21.5530 6.1139 4.5982 6.1100 5.8191 1.7749 1.4372 3.6016 7.5967
temp: 298.150 k
press: 1.00000 atm
elementType: 17 17 17 8 8 7 7 7 6 6 6 6 6 6 6 6 6 6 6 6 6 6 1 1 1 1 1 1 1 1 1 1
symmnumber: 1
zpe: 563623.6 jmol-1
zpe.correction: 0.214673 hartree
zpe.thermalcorrener: 0.235041 hartree
zpe.thermalcorrenthalpy: 0.235986 hartree
zpe.thermalcorrgfe: 0.160424 hartree
zpe.sumelectzpe: -2232.671074 hartree
zpe.sumelectthermal: -2232.650705 hartree
zpe.sumelectthermalent: -2232.649761 hartree
zpe.sumelectthermalfe: -2232.725323 hartree
dipole: 2.9031 5.7989 0.5364
dipole: 6.5071
quadrupole: -163.0993 -142.1236 -150.1036
quadrupole: -11.4144 -2.7600 -0.5201
quadrupole: -11.3238 9.6519 1.6719 -11.4144 -2.7600 -0.5201
hfenergy: -2232.8857466 hartree
pointgroup: C01 [X(C14H10Cl3N3O2)]
dipole: -1.2068958 2.2048192 -0.4860878 debye
polarizability: 310.5156591|3.1755462|222.7293153|55.0871841|-3.6366086|130.2710709 unknown
InChI: InChI=1S/C14H10Cl3N3O2/c15-11-3-1-9(13(16)5-11)7-18-19-8-10-2-4-12(20(21)22)6-14(10)17/h1-6H,7-8H2
charge 0 multiplicity 1
32 atoms
Cl 0.4440 -0.874171 -2.012635
Cl -1.334213 -0.544377 1.961206
Cl -5.995169 -2.861206 0.085331
O  5.977618 -1.420347 1.155964
O  4.770312 -3.063275 0.131055
N  -0.094013 2.170049 -0.040417
N  -1.272899 2.019874 -0.535891
N  4.961705 -1.834747 0.47629
C  2.014672 1.073128 -0.728067
C  0.976715 2.107627 -1.113758
C  -3.236003 0.87033 0.443614
C  -2.342085 2.092289 0.53255
C  1.883402 -0.300366 -1.05988
C  3.155711 1.453868 0.026868
C  3.947722 -0.829384 0.065276
C  2.832241 -1.263466 -0.680429
C  4.128477 0.521092 0.430355
C  -2.891811 -0.373051 1.02817
C  -4.463544 0.926185 -0.265969
C  -3.710681 -1.515133 0.933903
C  -5.313474 -0.193415 -0.386004
C  -4.918863 -1.401233 0.220459
H  1.444953 3.108787 -1.124821
H  0.521972 1.89587 -2.099359
H  -2.935715 2.994892 0.297655
H  -1.878671 2.202859 1.53149
H  3.270705 2.507324 0.303403
H  2.726493 -2.31873 -0.942392
H  5.006705 0.811919 1.011359
H  -4.756246 1.870403 -0.73854
H  -3.415058 -2.457866 1.400187
H  -6.255853 -0.128327 -0.935977
