program: Gaussian 09
title: 000293161
version: EM64L-G09RevD.01
frameworkgroup: C1[X(C10H14BrNO3S)]
method: RPBEPBE
basis: SDD
operation: Freq
keyword: #p
keyword: freq=noraman
keyword: PBEPBE/SDD
title: #p freq=noraman PBEPBE/SDD
converged: YES YES NO NO
title: Mulliken charges:
elementType: Br S O O O N C C C C C C C C C C H H H H H H H H H H H H H H
charge: 0.040129 0.903212 -0.490160 -0.537487 -0.538157 -0.477014 0.263915 -0.437258 -0.714064 -0.698394 0.009777 -0.253054 -0.220112 -0.156987 -0.160113 -0.207604 0.269363 0.254170 0.334801 0.200727 0.232975 0.266387 0.236039 0.210352 0.217555 0.347406 0.295832 0.281543 0.263534 0.262690
chargesum: 0.00000
title: Mulliken charges with hydrogens summed into heavy atoms:
elementType: Br S O O O N C C C C C C C C C C
charge: 0.040129 0.903212 -0.142754 -0.537487 -0.538157 -0.142213 0.263915 0.086275 -0.013976 -0.034447 0.009777 0.042778 0.061431 0.106547 0.102576 -0.207604
polarizability: 2.59951204e+02 -4.42985026e+00 1.34670369e+02 -9.35827442e+00 -1.82208982e+01 1.19392365e+02
1716.lowfreq: -13.6860 -3.2960 -0.0017 0.0006 0.0013 2.9911 18.7900 29.7485 33.9795
frequency: 18.2651 29.7454 33.7857 60.0401 82.4539 108.2278 120.7043 177.4098 198.8874 206.0353 218.4073 232.6381 251.5909 265.8130 280.1345 289.1322 326.0048 330.9445 341.4120 368.6600 390.2746 398.6639 407.7531 416.8478 443.3498 492.0096 515.9470 569.2742 610.8718 686.9203 706.5932 718.3860 793.3464 828.0335 830.7088 840.3916 857.1308 899.3794 924.0116 937.8377 957.1803 961.6850 978.0148 980.0572 1007.1856 1049.0619 1054.8752 1061.5848 1096.8268 1105.3728 1156.7974 1177.1165 1192.7961 1236.7587 1281.8890 1317.2804 1332.3917 1368.6885 1374.9215 1377.5049 1381.2858 1405.2757 1423.6387 1446.7611 1459.8323 1466.9478 1475.1181 1493.1927 1564.3288 1592.4026 2974.0513 2980.4929 2997.2819 3061.7067 3066.4645 3075.4333 3088.4438 3091.1035 3157.2781 3161.2232 3179.1154 3182.1465 3316.0203 3576.9067
redmass: 3.9742 4.7474 6.5237 4.1493 4.8548 6.5778 8.6545 6.2330 3.9829 1.8498 2.7432 4.9004 2.4441 1.3708 4.4360 1.1645 5.3785 2.0838 7.5647 3.9540 2.8134 3.5375 2.8888 3.9865 3.8693 4.0448 4.1296 3.4114 7.1005 6.5771 4.1303 4.2954 14.1918 1.4832 1.6291 1.3575 2.6342 2.5220 1.5656 2.8021 1.8762 1.3448 1.6179 4.0217 1.3813 7.3304 1.8017 2.8708 1.3899 1.3540 1.5554 1.1289 2.4894 1.4919 1.2289 1.3704 1.7724 1.3372 2.7876 8.9420 1.2343 1.1864 1.0875 2.1087 1.0557 1.0505 1.0658 1.0585 6.1504 8.2069 1.0374 1.0360 1.0604 1.1016 1.0989 1.0987 1.0999 1.0998 1.0898 1.0894 1.0962 1.0975 1.0731 1.0662
irintensity: 1.2140 0.2642 0.3930 0.6925 5.8296 1.8216 3.6304 2.7008 4.7524 8.9884 2.2012 2.3428 3.1436 6.2705 0.6863 122.2424 14.6154 5.6377 67.1594 14.9790 6.3060 13.6383 0.1686 11.4510 18.3605 36.0769 78.5556 35.8244 0.7097 32.0167 6.5742 35.1138 119.5923 42.2255 123.7790 33.8196 26.9583 47.2330 6.2656 65.5787 12.6789 0.2747 8.0704 44.7082 1.5731 72.6429 0.7334 28.2680 77.7908 14.5465 13.6176 10.1798 47.1847 17.0565 1.2628 12.2974 27.9853 6.3990 18.6660 3.1585 28.7414 18.5281 17.0993 61.7790 7.2018 3.5777 10.2482 29.2828 29.1298 0.8910 24.8798 28.8379 15.5986 6.5028 4.0881 36.9882 16.8438 22.8854 4.0542 1.2020 1.0351 3.7785 80.2258 6.2516
temp: 298.150 k
press: 1.00000 atm
elementType: 35 16 8 8 8 7 6 6 6 6 6 6 6 6 6 6 1 1 1 1 1 1 1 1 1 1 1 1 1 1
symmnumber: 1
zpe: 591508.3 jmol-1
zpe.correction: 0.225294 hartree
zpe.thermalcorrener: 0.243470 hartree
zpe.thermalcorrenthalpy: 0.244415 hartree
zpe.thermalcorrgfe: 0.176790 hartree
zpe.sumelectzpe: -1080.000371 hartree
zpe.sumelectthermal: -1079.982194 hartree
zpe.sumelectthermalent: -1079.981250 hartree
zpe.sumelectthermalfe: -1080.048874 hartree
dipole: -1.4383 -1.8231 -1.5191
dipole: 2.7749
quadrupole: -92.3313 -115.4263 -117.1256
quadrupole: 3.9232 4.0814 -9.5654
quadrupole: 15.9631 -7.1319 -8.8312 3.9232 4.0814 -9.5654
hfenergy: -1080.2256641 hartree
pointgroup: C01 [X(C10H14Br1N1O3S1)]
dipole: -0.5257523 0.9000947 0.3244584 debye
polarizability: 259.644701|-0.3738679|122.0260831|11.2038293|-19.6456163|132.3431543 unknown
InChI: InChI=1S/C10H14BrNO3S/c1-10(2,13)7-12-16(14,15)9-5-3-8(11)4-6-9/h3-6,12-13H,7H2,1-2H3
charge 0 multiplicity 1
30 atoms
Br 6.100819 0.245975 0.375911
S  -0.399633 -0.676538 -0.292147
O  -3.511189 1.250983 1.527446
O  -0.73644 -0.736179 -1.888193
O  -0.792096 -1.906115 0.71463
N  -1.087444 0.959519 0.310324
C  -3.629763 0.988269 0.060407
C  -2.246178 1.446993 -0.476623
C  -3.904336 -0.510783 -0.177724
C  -4.738291 1.877484 -0.537184
C  1.450009 -0.392446 -0.097825
C  2.089973 -0.977147 1.00517
C  2.118909 0.360063 -1.076006
C  3.48378 -0.786341 1.145814
C  3.511659 0.548551 -0.933642
C  4.17078 -0.022069 0.178308
H  -2.116855 1.139118 -1.530534
H  -2.191453 2.551271 -0.427436
H  -1.371553 0.813666 1.303291
H  -4.899414 -0.786548 0.222497
H  -3.896515 -0.748074 -1.256229
H  -3.148474 -1.148076 0.315535
H  -4.578735 2.931891 -0.251331
H  -5.734013 1.565784 -0.171226
H  -4.749641 1.808287 -1.64089
H  -4.270788 0.821581 1.99505
H  1.520657 -1.581474 1.718671
H  1.577767 0.773109 -1.93259
H  4.018748 -1.227481 1.990834
H  4.068806 1.127525 -1.674807
