program: Gaussian 09
title: 000293158
version: EM64L-G09RevD.01
frameworkgroup: C1[X(C11H16O3)]
method: RPBEPBE
basis: SDD
operation: Freq
keyword: #pfreq=noraman
keyword: PBEPBE/SDD
title: #p freq=noraman PBEPBE/SDD
converged: YES YES NO NO
title: Mulliken charges:
elementType: O O O C C C C C C C C C C C H H H H H H H H H H H H H H H H
charge: -0.467842 -0.344199 -0.291909 0.126389 0.337287 -0.736230 -0.716039 0.071087 -0.389410 0.256047 -0.261578 -0.366612 -0.525228 -0.535053 0.241592 0.191061 0.235176 0.227925 0.211694 0.241480 0.243701 0.223530 0.363919 0.242843 0.230259 0.269680 0.227189 0.228042 0.221791 0.243410
chargesum: 0.00000
title: Mulliken charges with hydrogens summed into heavy atoms:
elementType: O O O C C C C C C C C C C C
charge: -0.103924 -0.344199 -0.291909 0.126389 0.337287 -0.068402 -0.034941 0.071087 -0.145709 0.256047 -0.038048 -0.123768 0.201900 0.158190
polarizability: 1.64468202e+02 -2.73657923e+00 1.42820280e+02 6.68556185e-01 -2.51509936e+00 8.36505264e+01
1716.lowfreq: -8.4955 0.0001 0.0002 0.0005 9.8203 12.9687 44.1002 56.5478 95.4998
frequency: 44.0636 56.5244 95.4870 107.6233 142.9341 160.5470 187.9827 217.3243 226.6323 261.8481 271.8538 284.3478 291.1893 305.0675 311.4087 338.7551 379.8671 422.5300 435.2898 489.8985 529.5349 551.3569 567.7159 607.2783 627.3829 647.3510 737.4704 754.3605 782.4101 805.5085 860.9287 868.1032 915.2707 940.1191 945.4876 954.4763 994.7084 1022.0023 1083.8169 1111.3580 1113.1703 1118.6069 1137.0267 1150.1353 1155.8650 1164.1072 1182.9811 1204.9422 1244.5519 1255.5879 1360.1849 1369.3799 1373.7016 1390.1714 1414.8149 1432.7928 1444.3030 1453.8045 1458.3512 1462.3645 1466.7010 1468.3149 1477.1749 1478.9482 1484.2877 1486.0366 1582.8869 1600.5623 2962.8746 2979.6431 2986.4231 2998.0899 3052.7102 3079.7102 3088.6557 3098.7824 3099.0666 3105.6459 3124.1281 3134.7472 3136.9646 3161.9558 3173.6251 3435.1269
redmass: 3.2558 3.2411 2.5083 3.0232 1.9695 2.1312 2.3090 1.8899 1.1584 1.7808 1.2434 2.9462 2.6062 2.9088 3.4391 4.0840 3.2258 4.0233 3.5522 5.0308 3.3805 3.1714 4.7162 3.9771 1.3100 3.6148 1.8669 4.6172 2.6281 5.0252 3.4119 1.4358 1.7706 2.4385 4.4779 1.3385 1.3553 4.7593 2.2852 1.2568 1.2415 2.3651 2.0108 1.5190 1.4737 2.0472 1.6890 1.5799 2.3650 2.7912 1.7452 1.2489 4.8878 1.2664 1.3294 1.2767 1.4347 1.3658 1.3769 1.1003 1.0509 1.2626 1.1124 1.0925 1.0604 1.0720 5.9746 7.6314 1.0326 1.0344 1.0327 1.0353 1.1041 1.0996 1.1008 1.0998 1.0996 1.1001 1.0998 1.1051 1.0865 1.0911 1.0975 1.0636
irintensity: 2.9021 1.0484 7.9639 7.6182 1.2118 0.7025 4.4119 0.5826 0.0555 0.9007 0.2052 2.7211 1.3559 0.1952 9.1779 6.0942 8.8723 1.2397 10.3593 4.0719 1.9365 8.3229 0.7370 11.3246 191.4797 33.8003 42.2865 10.0433 28.4976 9.9868 14.3715 1.3485 7.0184 30.0731 23.8813 0.6546 13.0266 103.9481 56.3123 0.4197 5.9103 15.1399 18.9797 7.0819 1.1938 35.5388 35.9755 24.1027 106.0098 88.6102 69.5733 20.1950 29.6472 18.7747 17.5960 16.8222 82.1691 40.9610 25.2795 3.4923 13.1951 33.2393 5.9620 3.2764 20.8355 8.5658 19.8689 16.4911 66.8657 22.4061 62.0484 17.6487 43.7279 18.4912 22.8112 34.3359 29.6587 34.5957 22.2250 9.8886 5.0843 13.6946 16.0729 72.8341
temp: 298.150 k
press: 1.00000 atm
elementType: 8 8 8 6 6 6 6 6 6 6 6 6 6 6 1 1 1 1 1 1 1 1 1 1 1 1 1 1 1 1
symmnumber: 1
zpe: 651293.2 jmol-1
zpe.correction: 0.248064 hartree
zpe.thermalcorrener: 0.263153 hartree
zpe.thermalcorrenthalpy: 0.264097 hartree
zpe.thermalcorrgfe: 0.206800 hartree
zpe.sumelectzpe: -653.318754 hartree
zpe.sumelectthermal: -653.303666 hartree
zpe.sumelectthermalent: -653.302722 hartree
zpe.sumelectthermalfe: -653.360019 hartree
dipole: 4.1063 1.2183 0.2141
dipole: 4.2886
quadrupole: -73.3863 -77.0872 -88.4170
quadrupole: -3.4642 -3.9474 0.8166
quadrupole: 6.2439 2.5429 -8.7868 -3.4642 -3.9474 0.8166
hfenergy: -653.5668186 hartree
pointgroup: C01[X(C11H16O3)]
dipole: -1.6245208 0.455141 -0.0243208 debye
polarizability: 164.3687605|3.1406998|141.8605159|0.1772721|8.2562245|84.7097312 unknown
InChI: InChI=1S/C11H16O3/c1-11(2,12)8-6-5-7-9(13-3)10(8)14-4/h5-7,12H,1-4H3
charge 0 multiplicity 1
30 atoms
O  2.540162 -1.4986 0.514312
O  0.034393 -1.787429 -0.423208
O  -2.550083 -0.755212 -0.260231
C  2.402208 -0.160431 -0.108489
C  0.974487 0.402023 0.102303
C  3.496349 0.675662 0.578257
C  2.674914 -0.275182 -1.634492
C  -0.170946 -0.424359 -0.072958
C  0.76701 1.774551 0.397356
C  -1.486157 0.127081 0.007244
C  -0.529087 2.31172 0.515043
C  -1.662259 1.495024 0.316291
C  -0.655026 -2.813684 0.401957
C  -3.9051 -0.198113 -0.264431
H  4.445969 0.120171 0.499811
H  3.630684 1.660893 0.098985
H  3.268366 0.816721 1.648423
H  3.679661 -0.706112 -1.792576
H  2.62937 0.714524 -2.125032
H  1.929088 -0.933262 -2.114837
H  1.630931 2.427562 0.546005
H  -0.662744 3.371984 0.754766
H  1.807918 -2.045345 0.112671
H  -2.66485 1.925738 0.390826
H  -0.263916 -3.77645 0.037628
H  -1.742986 -2.75175 0.254689
H  -0.398797 -2.676515 1.469317
H  -4.003724 0.605439 -1.01921
H  -4.186349 0.190756 0.733428
H  -4.559184 -1.041108 -0.531945
