program: Gaussian 09
title: 000293167
version: EM64L-G09RevD.01
frameworkgroup: C1[X(C13H16O5)]
method: RPBEPBE
basis: SDD
operation: Freq
keyword: #pfreq=noraman
keyword: PBEPBE/SDD
title: #p freq=noraman PBEPBE/SDD
converged: YES YES NO NO
title: Mulliken charges:
elementType: O O O O O C C C C C C C C C C C C C H H H H H H H H H H H H H H H H
charge: -0.228629 -0.293500 -0.268809 -0.402142 -0.264576 -0.170344 -0.517006 0.073716 0.386135 -0.728995 -0.495719 -0.395047 0.209679 0.197085 0.186508 -0.328124 -0.543040 -0.499526 0.241610 0.291370 0.257644 0.212777 0.228101 0.246854 0.281592 0.275051 0.256374 0.378711 0.251568 0.222988 0.237799 0.251063 0.220337 0.228496
chargesum: 0.00000
title: Mulliken charges with hydrogens summed into heavy atoms:
elementType: O O O O O C C C C C C C C C C C C C
charge: -0.228629 -0.293500 -0.268809 -0.023431 -0.264576 0.071266 0.032008 0.073716 0.386135 -0.041262 -0.214128 -0.119997 0.209679 0.197085 0.186508 -0.071750 0.169315 0.200370
polarizability: 2.33314395e+02 -1.90316676e+01 1.61953473e+02 2.84817772e+00 1.10687522e+01 1.08050789e+02
1716.lowfreq: -11.1121 -3.5431 0.0004 0.0007 0.0008 7.7757 19.5449 31.7091 36.9850
frequency: 18.8702 31.6352 36.9202 55.5576 76.4258 82.7460 99.4892 113.2784 143.0232 159.9628 173.9925 206.2231 227.5582 229.2230 250.2265 259.4181 285.1658 300.7207 324.0363 353.1322 381.0961 410.0285 459.3168 466.8684 491.3398 515.6997 545.3131 574.6720 588.7957 627.4833 648.9682 698.4951 713.3328 732.3826 756.3428 839.2218 847.3155 856.5439 881.4127 907.8698 939.4305 962.1452 970.0587 975.7081 1006.5129 1042.0579 1056.1628 1084.3501 1107.2645 1109.6546 1112.8249 1133.9979 1151.0386 1159.3914 1172.9814 1182.7400 1240.1354 1251.5172 1264.2200 1281.8791 1301.9387 1337.0963 1361.3280 1379.2484 1385.6695 1407.2552 1437.5040 1439.2056 1446.8338 1453.9877 1464.7644 1467.7516 1469.1295 1476.2281 1485.3524 1504.7732 1546.4227 1583.0105 1607.0544 1648.9826 2968.9839 2984.3227 2989.2471 2994.9640 3049.5274 3061.7948 3067.1711 3081.0339 3096.5600 3104.3043 3126.9594 3132.7588 3155.2365 3168.4444 3175.4068 3510.5263
redmass: 6.1694 2.5068 5.1043 4.9941 6.4958 3.2037 3.1996 2.9493 2.1958 3.9451 2.8755 2.7715 2.4369 1.1554 4.2289 1.9339 1.9982 3.6655 5.1316 4.1898 4.5605 5.8977 3.5168 3.3743 3.7789 2.4242 5.2338 4.8360 4.3455 3.5944 1.5822 3.6425 4.7596 4.7160 3.4978 1.7846 2.5691 4.3029 1.5903 1.9851 2.6887 5.9136 1.5453 3.2377 2.9395 1.9568 2.2177 2.4060 1.4615 1.3746 1.4128 2.1433 1.2927 1.4905 1.7406 1.3060 1.9370 1.6226 3.9830 1.4383 1.4449 1.8967 1.8651 3.7549 1.2434 3.2426 1.0983 1.2637 1.2890 1.0599 1.0507 1.0538 1.0493 1.1098 1.0605 2.5098 7.5352 7.8786 6.0209 7.9228 1.0327 1.0350 1.0649 1.0312 1.0854 1.1036 1.0936 1.1000 1.0998 1.1011 1.1011 1.1057 1.0877 1.0905 1.0971 1.0639
irintensity: 0.7217 5.5279 1.3726 1.2039 1.6026 2.1486 8.2495 2.3379 5.4072 2.2550 0.5933 3.3702 1.2234 0.4074 0.8451 0.8041 2.5449 18.5031 1.6628 4.9770 8.8837 9.6986 6.9043 7.0168 17.1923 32.2731 2.8042 15.7709 11.2968 39.4372 90.2015 14.9048 6.7719 13.9410 18.8984 33.8680 8.9728 12.6401 54.5756 11.9666 10.1932 72.8708 0.7107 1.8018 62.7378 150.6573 61.2464 76.6147 32.4258 44.3936 37.8997 49.8206 8.6822 30.4604 52.8338 24.3780 19.2826 6.6264 472.7532 8.6345 27.9644 93.6280 59.7241 18.5577 39.6789 30.8526 58.8630 2.4228 3.4983 17.8485 33.9549 19.5037 12.6893 73.0982 18.0976 61.4904 305.0487 7.1922 77.5401 229.1623 45.5808 35.5288 20.3234 78.6539 3.9600 32.3845 2.6242 33.1970 20.2731 38.3994 24.9359 21.1525 1.1492 6.4084 9.4094 24.8431
temp: 298.150 k
press: 1.00000 atm
elementType: 8 8 8 8 8 6 6 6 6 6 6 6 6 6 6 6 6 6 1 1 1 1 1 1 1 1 1 1 1 1 1 1 1 1
symmnumber: 1
zpe: 702476.8 jmol-1
zpe.correction: 0.267559 hartree
zpe.thermalcorrener: 0.286637 hartree
zpe.thermalcorrenthalpy: 0.287581 hartree
zpe.thermalcorrgfe: 0.218226 hartree
zpe.sumelectzpe: -879.723392 hartree
zpe.sumelectthermal: -879.704315 hartree
zpe.sumelectthermalent: -879.703371 hartree
zpe.sumelectthermalfe: -879.772725 hartree
dipole: -0.3789 4.0141 2.5032
dipole: 4.7458
quadrupole: -96.9837 -102.5109 -104.8393
quadrupole: 3.9742 -0.7860 -4.0818
quadrupole: 4.4609 -1.0663 -3.3946 3.9742 -0.7860 -4.0818
hfenergy: -879.9909514 hartree
pointgroup: C01 [X(C13H16O5)]
dipole: 0.3827939 1.0134584 1.5207285 debye
polarizability: 232.2894134|-19.0030487|112.1286378|16.8077954|11.3431418|158.9006057 unknown
InChI: InChI=1S/C13H16O5/c1-8(6-12(14)15)13(16)9-4-5-10(17-2)11(7-9)18-3/h4-5,7-8,14H,6H2,1-3H3
charge 0 multiplicity 1
34 atoms
O  -2.138706 -0.501677 -2.143987
O  2.675466 0.07699 1.578031
O  4.07819 -1.157511 -0.653433
O  -3.846996 -0.924612 2.218657
O  -1.806874 0.166824 2.309326
C  -2.200794 1.20624 -0.425856
C  -3.348198 0.577616 0.405262
C  -1.473513 0.115482 -1.253018
C  -0.025371 -0.161904 -1.044265
C  -2.770859 2.254871 -1.417209
C  0.643744 0.180648 0.162621
C  0.697448 -0.840488 -2.063142
C  2.000242 -0.14495 0.362789
C  -2.884396 -0.051674 1.704393
C  2.738579 -0.77537 -0.692603
C  2.059837 -1.121589 -1.889432
C  1.898167 0.660277 2.679736
C  5.053223 -0.460432 0.210336
H  -1.498051 1.710268 0.25826
H  -3.893874 -0.172855 -0.193863
H  -4.088619 1.357246 0.67769
H  -3.306212 3.053278 -0.871396
H  -1.962479 2.724242 -2.00568
H  -3.467954 1.771169 -2.123317
H  0.072708 0.626161 0.98093
H  0.172507 -1.12344 -2.980305
H  2.646536 -1.616833 -2.669046
H  -3.527581 -1.299066 3.084733
H  1.016686 0.038906 2.92512
H  1.565195 1.687213 2.434167
H  2.592557 0.687533 3.532341
H  4.891784 -0.706838 1.270286
H  4.98663 0.633639 0.072458
H  6.030877 -0.828767 -0.136884
