program: Gaussian 09
title: 000022509
version: EM64L-G09RevD.01
frameworkgroup: C1[X(C13H15NO2)]
method: RPBEPBE
basis: SDD
operation: Freq
keyword: #p
keyword: freq=noraman
keyword: PBEPBE/SDD
title: #p freq=noraman PBEPBE/SDD
converged: YES YES NO NO
title: Mulliken charges:
elementType: O O N C C C C C C C C C C C C C H H H H H H H H H H H H H H H
charge: -0.325734 -0.264862 -0.241440 -0.432773 -0.535693 -0.455264 0.338641 -0.305846 0.259310 0.418387 -0.652764 -0.324609 -0.366086 -0.225462 -0.231230 -0.249838 0.219854 0.224771 0.226066 0.228860 0.217983 0.217857 0.293574 0.277707 0.233556 0.240138 0.290010 0.244000 0.226585 0.224911 0.229393
chargesum: 0.00000
title: Mulliken charges with hydrogens summed into heavy atoms:
elementType: O O N C C C C C C C C C C C C C
charge: -0.325734 -0.264862 -0.241440 0.011852 -0.080767 -0.019423 0.338641 -0.012272 0.259310 0.418387 0.098637 -0.034599 -0.122086 0.001123 -0.006319 -0.020445
polarizability: 2.37240901e+02 -3.98045613e+00 1.52950429e+02 -3.18117891e+00 5.91099061e+00 8.22605732e+01
1716.lowfreq: -10.2443 -5.0645 -0.0006 -0.0005 0.0004 0.3350 26.5051 29.5413 45.2641
frequency: 25.6347 28.9255 45.2237 76.1613 82.0071 125.8003 147.9420 196.3548 217.6175 244.8580 256.2175 302.3634 345.5511 359.5243 400.1122 411.8445 460.1928 514.1173 549.3355 610.0836 615.7695 633.6850 678.9725 687.4598 694.9248 756.4119 764.9365 796.9871 830.2668 834.4698 850.3354 892.7306 896.4692 907.2131 929.7215 967.8620 972.5744 985.5026 990.0417 1031.1462 1049.7637 1056.6899 1078.0929 1102.5186 1106.3002 1122.5239 1124.3410 1146.2358 1175.0536 1195.9081 1202.1176 1203.3270 1230.3774 1254.5805 1281.6514 1297.7161 1318.2473 1332.1925 1344.2760 1382.6967 1439.3114 1445.0104 1461.7684 1468.6787 1478.9737 1482.4062 1488.1472 1498.2622 1589.0918 1611.6839 1637.4555 1658.4832 2966.7798 2978.4386 2988.0533 3011.0946 3027.2812 3037.6780 3080.2206 3081.6260 3128.6516 3139.0881 3157.0436 3159.3446 3171.4107 3206.1196 3227.2407
redmass: 3.1277 3.9765 4.7390 4.4879 4.7064 1.8400 3.5902 1.3531 3.6059 3.9597 3.1593 4.6754 4.7833 4.3815 3.7661 3.0372 2.6401 3.2314 5.1138 5.6988 6.2017 2.5279 10.5462 5.1598 2.0260 6.3439 1.8269 1.7578 1.6043 1.3233 2.2760 2.6273 1.7296 1.4483 2.7127 1.3662 1.8478 4.8741 1.3770 2.3679 1.7522 2.0983 2.3267 2.0527 1.7499 1.4013 1.2722 2.3890 1.0569 1.2376 1.1309 1.5386 4.0815 1.5191 1.3277 1.6468 2.1727 1.4687 2.5220 8.2650 1.3012 1.9406 1.0911 1.0829 1.0684 1.1078 2.2166 1.0655 6.2317 6.0199 8.2508 8.6633 1.0642 1.0621 1.0421 1.0726 1.0916 1.0941 1.0969 1.1046 1.0850 1.0903 1.0966 1.0953 1.0978 1.0940 1.0968
irintensity: 0.1927 0.2660 4.6615 0.1904 0.3417 0.9528 1.9438 0.7837 2.1572 0.3202 0.6871 1.5439 11.8247 3.0663 0.4042 1.0116 5.6952 10.8042 9.0161 6.7681 2.1244 2.5724 11.6248 2.8169 39.1823 46.0456 69.3008 13.1847 13.7952 9.6200 7.5429 6.0143 12.4811 7.2924 36.9173 0.7557 15.0214 0.0189 0.5607 8.5958 3.3810 13.7047 283.3854 140.9555 270.0890 0.2641 55.4459 223.3684 3.8831 0.9477 3.7819 98.2713 77.3897 29.3259 36.0980 22.2097 291.2722 38.5231 47.8506 1.0381 20.4681 15.3806 4.7876 8.2880 38.2200 1.0578 109.9662 42.8931 2.0882 73.4419 56.8383 243.1514 61.4340 36.9699 45.7980 27.6240 41.8621 34.2946 23.6718 56.1641 1.3135 17.0184 17.0005 23.1833 13.2687 2.5194 1.3610
temp: 298.150 k
press: 1.00000 atm
elementType: 8 8 7 6 6 6 6 6 6 6 6 6 6 6 6 6 1 1 1 1 1 1 1 1 1 1 1 1 1 1 1
symmnumber: 1
zpe: 662380.1 jmol-1
zpe.correction: 0.252287 hartree
zpe.thermalcorrener: 0.267175 hartree
zpe.thermalcorrenthalpy: 0.268119 hartree
zpe.thermalcorrgfe: 0.208264 hartree
zpe.sumelectzpe: -708.392823 hartree
zpe.sumelectthermal: -708.377935 hartree
zpe.sumelectthermalent: -708.376991 hartree
zpe.sumelectthermalfe: -708.436847 hartree
dipole: 0.2914 2.6878 -0.3158
dipole: 2.7219
quadrupole: -79.4791 -87.9998 -97.1603
quadrupole: -0.6407 -0.5221 2.0741
quadrupole: 8.7340 0.2133 -8.9472 -0.6407 -0.5221 2.0741
hfenergy: -708.6451107 hartree
pointgroup: C01 [X(C13H15N1O2)]
dipole: 0.1112527 -0.999527 0.3679111 debye
polarizability: 237.0117983|5.2726611|151.8807908|5.7265923|-10.4874344|83.5593143 unknown
InChI: InChI=1S/C13H15NO2/c1-14(11-7-3-2-4-8-11)13(15)16-12-9-5-6-10-12/h2-4,7-9H,5-6,10H2,1H3
charge 0 multiplicity 1
31 atoms
O  1.479024 -0.593629 0.252854
O  0.309545 1.33514 -0.427413
N  -0.820554 -0.626214 0.286177
C  5.152359 -0.075289 0.327624
C  3.903565 -1.009652 0.362818
C  4.702717 1.209785 -0.448822
C  2.771891 -0.044347 0.063624
C  3.18199 1.172648 -0.381638
C  0.29942 0.155187 -0.003517
C  -2.160891 -0.143807 0.045613
C  -0.665666 -2.018841 0.773861
C  -2.484883 1.241546 0.053634
C  -3.200687 -1.090329 -0.16844
C  -3.818617 1.653655 -0.147174
C  -4.530801 -0.66264 -0.36594
C  -4.852112 0.712157 -0.355991
H  6.026052 -0.562919 -0.137335
H  5.434543 0.200243 1.359507
H  3.7751 -1.514935 1.337812
H  3.949481 -1.80256 -0.41038
H  5.044406 1.190257 -1.504386
H  5.120965 2.130088 0.000765
H  2.531799 1.990264 -0.68886
H  0.317233 -2.130901 1.245712
H  -0.739617 -2.750229 -0.052995
H  -1.453768 -2.23006 1.515321
H  -1.698765 1.983019 0.196754
H  -2.980538 -2.160953 -0.200259
H  -4.047835 2.725157 -0.135798
H  -5.313608 -1.410823 -0.533851
H  -5.884549 1.043381 -0.509676
