program: Gaussian 09
title: 000293148
version: EM64L-G09RevD.01
frameworkgroup: C1[X(C10H12ClNO3S)]
method: RPBEPBE
basis: SDD
operation: Freq
keyword: #p
keyword: freq=noraman
keyword: PBEPBE/SDD
title: #p freq=noraman PBEPBE/SDD
converged: YES YES NO NO
title: Mulliken charges:
elementType: Cl S O O O N C C C C C C C C C C H H H H H H H H H H H H
charge: -0.215290 0.898731 -0.238703 -0.459366 -0.462454 -0.462979 -0.225272 0.229793 0.508247 -0.674557 -0.673363 -0.134134 -0.425431 -0.310530 -0.181373 -0.208444 0.203128 0.219627 0.221281 0.248009 0.223042 0.218058 0.247383 0.312575 0.240597 0.325524 0.288078 0.287824
chargesum: 0.00000
title: Mulliken charges with hydrogens summed into heavy atoms:
elementType: Cl S O O O N C C C C C C C C C C
charge: -0.215290 0.898731 -0.238703 -0.459366 -0.462454 -0.150404 -0.022144 0.229793 0.508247 0.014360 0.015120 -0.134134 -0.184834 0.014993 0.106705 0.079381
polarizability: 2.97787946e+02 -3.01628736e+00 1.36156309e+02 -4.48299132e+00 -9.52722626e+00 1.33031549e+02
1716.lowfreq: -6.8458 -4.4159 -0.0005 0.0005 0.0017 2.5150 24.9875 27.3121 36.4823
frequency: 23.8091 27.2483 36.4461 62.1523 80.4894 84.8484 147.3683 152.0478 179.2257 184.6759 204.2762 230.8592 238.5025 248.5947 283.3918 289.1179 322.1671 332.0852 376.0596 392.8488 412.8033 422.5302 456.4399 528.5023 608.8640 627.4842 659.1409 667.2259 716.4427 728.7925 803.5760 823.9172 827.6504 864.8028 867.5330 923.6194 925.8126 959.9009 961.8049 963.2536 978.2195 1003.2648 1047.5895 1095.0287 1104.3649 1124.8205 1132.5220 1180.9066 1188.0113 1268.7947 1283.6226 1294.1146 1341.8268 1370.9139 1376.6696 1395.4619 1412.7600 1462.2054 1471.6776 1472.1704 1477.4877 1491.8396 1495.9761 1586.7020 1594.8176 1631.0845 2968.9363 2987.1204 2988.9208 3082.8753 3086.9328 3095.9579 3101.2577 3133.0678 3164.7676 3171.2759 3195.9417 3523.7450
redmass: 4.9272 5.3897 4.3101 4.8511 6.1408 8.0043 6.1708 5.3395 14.2213 6.3757 1.0468 9.4200 1.2992 4.4105 4.3023 2.9148 7.7895 6.5492 5.2960 4.4925 3.0417 6.3470 6.6354 2.9219 6.0768 5.9372 1.1949 3.2939 3.9966 4.5298 5.2398 16.3568 1.3872 1.4684 3.9682 1.1482 2.9208 3.0903 2.1568 1.4797 5.8114 1.3213 2.4276 1.5221 2.5310 1.3483 2.6947 1.7124 1.2222 2.0889 1.3714 1.3995 1.6629 3.2367 1.1860 1.2179 5.0974 1.0447 2.2703 1.0516 1.0551 1.0581 2.2575 6.7585 5.3788 4.7722 1.0829 1.0348 1.0364 1.1008 1.1000 1.1011 1.1004 1.0903 1.0914 1.0957 1.0957 1.0764
irintensity: 1.0327 1.6025 1.1674 1.1820 1.6718 3.5564 2.1145 3.5613 1.4023 0.6961 0.3508 0.5608 6.9109 8.0646 9.8742 0.5508 38.1433 10.2719 4.3983 14.6396 1.9444 43.0542 122.7588 61.9751 2.2441 18.5447 49.7905 1.1304 10.7674 4.0647 2.7814 91.5511 31.3251 64.8808 6.7995 6.6634 26.8037 36.2879 19.7825 0.4323 9.0148 4.2405 46.0936 18.9563 0.4561 16.0901 171.4684 56.1906 6.7851 58.8313 0.1620 58.3889 17.7539 223.2753 14.6633 45.6064 17.9523 6.8429 14.9570 3.2941 27.8416 29.3282 497.9479 116.9719 71.8362 77.7561 36.6743 31.8676 24.9180 20.7597 51.0976 2.1323 34.9575 9.2017 5.5171 6.5512 16.8238 22.8807
temp: 298.150 k
press: 1.00000 atm
elementType: 17 16 8 8 8 7 6 6 6 6 6 6 6 6 6 6 1 1 1 1 1 1 1 1 1 1 1 1
symmnumber: 1
zpe: 540891.3 jmol-1
zpe.correction: 0.206015 hartree
zpe.thermalcorrener: 0.223395 hartree
zpe.thermalcorrenthalpy: 0.224339 hartree
zpe.thermalcorrgfe: 0.158309 hartree
zpe.sumelectzpe: -1525.475838 hartree
zpe.sumelectthermal: -1525.458458 hartree
zpe.sumelectthermalent: -1525.457514 hartree
zpe.sumelectthermalfe: -1525.523544 hartree
dipole: -9.0919 3.1881 -2.7301
dipole: 10.0140
quadrupole: -124.7517 -110.6571 -111.7015
quadrupole: -7.6138 6.7683 -4.2928
quadrupole: -9.0483 5.0463 4.0020 -7.6138 6.7683 -4.2928
hfenergy: -1525.6818529 hartree
pointgroup: C01 [X(C10H12Cl1N1O3S1)]
dipole: -3.5465291 1.6750204 -0.3722333 debye
polarizability: 296.1853037|-7.4539919|142.1731425|-15.7433318|-5.7153533|128.6173578 unknown
InChI: InChI=1S/C10H12NO3S.Cl/c1-7(2)10(12)11-8-3-5-9(6-4-8)15(13)14;/h3-7,11H,1-2H3;
charge 0 multiplicity 1
28 atoms
Cl 4.547332 -0.981725 -2.028316
S  4.062243 -0.126833 0.195136
O  -2.835376 -1.3276 0.624624
O  4.399405 -1.310693 1.245698
O  4.770141 1.32628 0.292117
N  -1.930321 0.674047 -0.204435
C  -4.396201 0.423783 -0.102774
C  -3.000436 -0.171244 0.142509
C  -0.541116 0.433401 -0.093605
C  -5.187103 -0.504111 -1.060238
C  -5.128936 0.577562 1.256339
C  2.214593 0.091769 0.070975
C  0.338411 1.475548 -0.509996
C  -0.009349 -0.788952 0.410937
C  1.730923 1.310001 -0.438185
C  1.385528 -0.964261 0.484015
H  -4.300994 1.425315 -0.571969
H  -4.697499 -0.589619 -2.047082
H  -6.207745 -0.110487 -1.21267
H  -5.260699 -1.515308 -0.624228
H  -6.148204 0.970887 1.094313
H  -4.595945 1.266935 1.936034
H  -5.206343 -0.405048 1.753081
H  -2.194372 1.586787 -0.584065
H  -0.068842 2.418264 -0.894327
H  -0.692049 -1.576974 0.732591
H  2.416238 2.10423 -0.74812
H  1.813317 -1.893752 0.872039
