program: Gaussian 09
title: 000293146
version: EM64L-G09RevD.01
frameworkgroup: C1[X(C9H10ClNO3S)]
method: RPBEPBE
basis: SDD
operation: Freq
keyword: #p
keyword: freq=noraman
keyword: PBEPBE/SDD
title: #p freq=noraman PBEPBE/SDD
converged: YES YES NO NO
title: Mulliken charges:
elementType: Cl S O O O N C C C C C C C C C H H H H H H H H H H
charge: -0.218880 0.898747 -0.255512 -0.462915 -0.459291 -0.202552 0.439659 -0.128524 -0.288657 -0.330393 -0.223951 -0.222651 -0.676051 0.237671 -0.805304 0.324459 0.260524 0.287465 0.286319 0.267854 0.244967 0.258032 0.246936 0.243538 0.278510
chargesum: 0.00000
title: Mulliken charges with hydrogens summed into heavy atoms:
elementType: Cl S O O O N C C C C C C C C C
charge: -0.218880 0.898747 -0.255512 -0.462915 -0.459291 -0.202552 0.439659 -0.128524 0.035802 -0.069869 0.063514 0.063668 0.094803 0.237671 -0.036320
polarizability: 2.74163291e+02 2.13526074e+00 1.41510554e+02 -3.38935903e+00 2.99597766e+00 1.10007095e+02
1716.lowfreq: -4.6851 -1.6311 0.0012 0.0016 0.0019 10.6862 24.8947 40.5134 42.9690
frequency: 23.3704 40.4835 42.6649 63.7223 97.2047 109.3138 176.5881 191.0097 196.9549 208.4714 221.9837 237.8257 258.6450 318.0018 341.4327 360.1034 388.5678 411.5705 422.6713 424.2951 464.6285 519.3368 567.8710 582.7545 586.0553 619.1173 707.8848 718.1058 817.5287 823.2665 845.0948 857.0465 958.8728 959.8640 973.5160 985.6306 993.2654 1031.9687 1054.9925 1094.7233 1113.3543 1114.2942 1150.6508 1199.9803 1241.1566 1298.0042 1319.9197 1382.0087 1384.6523 1413.4791 1440.4564 1455.3028 1470.4873 1473.6438 1497.0922 1502.5294 1576.0558 1582.2798 1607.5356 2987.6532 2991.8667 3079.2722 3080.6140 3132.4935 3152.7292 3162.4331 3164.4993 3186.9224 3217.4730
redmass: 6.1197 5.8655 3.9491 4.2836 7.6404 5.5361 15.1447 3.6596 1.5587 6.0465 3.1111 8.2659 1.4363 6.6276 5.6610 6.4883 4.6549 3.0948 5.7483 3.3696 5.7702 3.0974 4.0017 3.2257 5.0524 6.9483 5.7021 3.3038 1.3049 17.5619 1.8687 2.7587 2.1294 3.0664 5.1483 1.3481 1.6198 1.6740 2.5711 2.5204 1.5602 1.5411 1.5674 1.1653 4.2131 1.6434 2.2523 1.2274 7.0850 3.5210 1.1124 1.1189 1.0790 2.2008 1.0644 1.0476 7.4732 5.8470 7.8410 1.0429 1.0389 1.0974 1.0980 1.0985 1.0951 1.0899 1.0921 1.0947 1.0938
irintensity: 4.4079 0.5180 1.1653 2.5284 0.8498 2.7917 0.4451 3.1427 1.2836 10.7003 2.7655 3.9782 3.2814 3.8774 7.1258 49.6809 7.3141 2.2916 25.1749 38.2408 94.1520 41.0002 37.0023 3.6347 9.9705 2.9433 1.2505 13.2578 9.8496 95.5500 47.0547 35.3392 22.9322 30.5467 14.2171 2.4362 79.8246 8.0757 67.6589 28.8466 67.1994 3.0500 45.4781 47.2405 28.1304 161.3448 334.8421 56.3623 1.0036 12.9936 42.0274 16.7150 50.9232 94.5026 61.6286 6.7850 5.0450 150.8186 144.2614 38.4211 5.5797 21.6246 5.4321 6.8501 10.8799 2.8451 4.2233 7.4460 17.9581
temp: 298.150 k
press: 1.00000 atm
elementType: 17 16 8 8 8 7 6 6 6 6 6 6 6 6 6 1 1 1 1 1 1 1 1 1 1
symmnumber: 1
zpe: 466993.7 jmol-1
zpe.correction: 0.177868 hartree
zpe.thermalcorrener: 0.193762 hartree
zpe.thermalcorrenthalpy: 0.194706 hartree
zpe.thermalcorrgfe: 0.132528 hartree
zpe.sumelectzpe: -1486.234793 hartree
zpe.sumelectthermal: -1486.218899 hartree
zpe.sumelectthermalent: -1486.217955 hartree
zpe.sumelectthermalfe: -1486.280133 hartree
dipole: 9.6603 -4.3049 0.1405
dipole: 10.5770
quadrupole: -107.1523 -102.8544 -108.1150
quadrupole: -13.7116 0.6394 2.2678
quadrupole: -1.1118 3.1862 -2.0744 -13.7116 0.6394 2.2678
hfenergy: -1486.4126612 hartree
pointgroup: C01 [X(C9H10Cl1N1O3S1)]
dipole: -3.8126286 -1.6674367 -0.0014164 debye
dipolederiv: -0.5561021 0.0185569 0.1168322 0.129282 -0.2772044 -0.1409849 0.5197885 -0.118196 -0.7492688 2.1898531 0.0183956 -0.1684168 0.0167743 0.9958105 0.1685559 -0.2815754 0.1543358 1.6087827 -0.6307444 -0.1035951 -0.0069453 0.4912219 -1.0203892 -0.0381521 0.0547136 -0.0411672 -0.3226245 -0.6928189 0.0031053 -0.0047938 0.0943648 -0.4289489 0.1312873 -0.107515 0.0374292 -0.5491884 -0.6584789 -0.018665 0.0198486 -0.1539942 -0.5368835 -0.1281123 -0.0280532 -0.0405065 -0.4396038 -2.1898196 0.3374748 0.0116362 0.4861581 -0.7103025 0.0177319 -0.0125318 -0.0683234 -0.2136768 1.7100361 -0.0089586 0.056198 0.2466601 0.0143332 -0.0481232 0.1014433 -0.0228357 0.1130079 -0.4601172 -0.0248941 -0.0383433 -0.1113917 -0.1125509 -0.0178056 -0.3541537 -0.0206253 -0.1674059 -0.5046493 -0.1159064 0.0304627 -0.3193982 -0.0754707 -0.0237562 -0.0541176 -0.0030324 -0.1117096 -0.549163 0.083796 -0.00907 0.2863 0.0026552 -0.0226408 -0.0668109 -0.0382788 -0.1508959 0.201255 0.0916312 0.0166826 -0.3196318 0.0268733 -0.0211233 0.2612152 0.0164438 -0.0953945 0.1436525 -0.0397917 0.0498066 0.3929812 0.015023 -0.0319536 0.0950441 -0.0469704 -0.0734894 0.0673847 0.0877025 -0.0104089 0.273313 0.3836526 -0.0371612 -0.0486736 -0.0316012 0.2138801 1.7408498 -0.2983288 -0.0294703 -1.1623043 1.3537685 0.0615796 0.0379661 0.0615916 0.1635504 -0.485926 -0.0511574 -0.0097565 -0.1396588 -0.0262508 -0.0127315 -0.0872412 -0.0077302 0.0500589 0.1751451 0.0337532 -0.016087 -0.0603793 0.1004532 0.0281955 -0.0661592 0.0082426 0.1738994 0.0404326 -0.0730427 0.0181124 -0.0883376 -0.0102718 0.0401772 -0.0281439 0.0435951 0.1518073 0.1058486 -0.0577767 -0.0028155 -0.016397 0.0752573 0.0204664 0.0246528 -0.0003375 0.1411904 0.0956338 0.0550134 -0.0321259 0.0210507 0.0864039 0.009531 -0.0089089 0.0247518 0.136392 -0.0899643 -0.0622627 -0.0738614 -0.0089724 0.1132515 0.0298949 -0.076202 0.0141829 0.0877397 0.1156009 0.0099561 -0.0185037 -0.0691833 -0.0447867 0.0465599 0.0194832 0.1157113 -0.08121 0.0677773 0.1098536 0.1023859 0.0060166 -0.0059469 -0.0353818 0.0750113 -0.041772 0.0252678 0.0552208 -0.0116035 -0.0086785 -0.0562692 0.0130063 0.1140193 0.0404052 0.1043763 0.0116263 0.0447971 -0.0159004 -0.004019 -0.0536196 0.0847284 -0.0797324 -0.0407036 -0.0750844 -0.0477028 0.0642964 0.0326445 0.0113306 0.1154147 -0.0162107 -0.0303404 0.0310666 -0.0241995 0.1249675 unknown
polarizability: 273.7919477|-2.8887098|141.7067545|-8.2484075|-1.820935|110.182237 unknown
InChI: InChI=1S/C9H10NO3S.Cl/c1-7(11)10(2)8-3-5-9(6-4-8)14(12)13;/h3-6H,1-2H3;
charge 0 multiplicity 1
25 atoms
Cl 4.156316 -0.438753 -2.007755
S  3.510099 0.173397 0.256336
O  -3.125261 1.831761 -0.084468
O  4.09013 -0.984438 1.228981
O  3.902048 1.730356 0.459542
N  -2.540157 -0.449488 -0.18493
C  -1.124688 -0.258117 -0.070929
C  1.657951 0.003844 0.122723
C  -0.49718 1.004193 -0.308986
C  -0.30608 -1.375998 0.279606
C  0.90116 1.133905 -0.2248
C  1.091529 -1.255519 0.371197
C  -3.023677 -1.848877 -0.286176
C  -3.478918 0.619594 -0.137009
C  -4.962515 0.255313 -0.140661
H  -1.108834 1.873066 -0.5463
H  -0.747745 -2.349049 0.503473
H  1.382412 2.098627 -0.412184
H  1.715012 -2.109893 0.650918
H  -4.042574 -1.868113 -0.690437
H  -3.028324 -2.357132 0.69666
H  -2.381439 -2.415262 -0.980621
H  -5.226149 -0.484311 0.63526
H  -5.286493 -0.140363 -1.121266
H  -5.515922 1.185956 0.050621
