program: Gaussian 09
title: 000293173
version: EM64L-G09RevD.01
frameworkgroup: C1[X(C22H20O2)]
method: RPBEPBE
basis: SDD
operation: Freq
keyword: #pfreq=noraman
keyword: PBEPBE/SDD
title: #p freq=noraman PBEPBE/SDD
converged: YES YES NO NO
title: Mulliken charges:
elementType: O O C C C C C C C C C C C C C C C C C C C C C C H H H H H H H H H H H H H H H H H H H H
charge: -0.222103 -0.222131 -0.591696 -0.591763 0.216049 0.216053 0.129662 0.129779 -0.802480 -0.802456 -0.035846 -0.035867 0.324246 0.324202 -0.355185 -0.355181 -0.351403 -0.351446 -0.235500 -0.235518 -0.236400 -0.236415 -0.233210 -0.233224 0.225966 0.261576 0.226017 0.261585 0.225048 0.223334 0.222576 0.222561 0.225100 0.223287 0.264128 0.264211 0.272657 0.272649 0.234818 0.234825 0.231622 0.231613 0.232134 0.232125
chargesum: 0.00000
title: Mulliken charges with hydrogens summed into heavy atoms:
elementType: O O C C C C C C C C C C C C C C C C C C C C C C
charge: -0.222103 -0.222131 -0.104154 -0.104161 0.216049 0.216053 0.129662 0.129779 -0.131521 -0.131509 -0.035846 -0.035867 0.324246 0.324202 -0.091057 -0.090970 -0.078746 -0.078796 -0.000682 -0.000693 -0.004779 -0.004801 -0.001076 -0.001099
polarizability: 2.85792129e+02 -2.75833799e-02 1.90310199e+02 -3.64056276e-02 -4.19841558e+00 2.30003527e+02
1716.lowfreq: -8.6054 -0.0009 -0.0004 0.0006 0.8204 3.9722 19.1075 20.7171 37.6399
frequency: 18.5351 20.4673 37.6337 39.4330 55.4508 59.3151 83.6967 98.6288 104.9294 115.7272 142.7084 147.2132 170.7256 176.2233 189.8151 245.0723 266.0773 267.0605 301.4007 328.0135 352.5222 354.8006 397.8480 404.6101 404.9352 425.8496 434.7521 462.8437 484.2862 530.4723 561.1202 592.2462 598.7190 613.0190 613.2206 668.7349 681.2460 691.3509 692.3161 702.6177 705.8748 733.7828 793.5304 806.1113 825.1484 860.0192 862.2244 882.8016 894.4635 928.8762 948.0410 950.1702 953.1420 988.9722 989.1634 991.0058 991.8755 992.9091 1006.4517 1006.6391 1015.5023 1024.0212 1030.7423 1036.4716 1049.6418 1081.8738 1084.3169 1106.3254 1124.3434 1158.5241 1165.4919 1173.6637 1173.9024 1185.3259 1186.8359 1192.3006 1205.6382 1231.3469 1274.4619 1278.3430 1315.5464 1316.7318 1325.6265 1372.6532 1386.7729 1387.1684 1389.3601 1403.7388 1434.5983 1434.9250 1444.1033 1448.9013 1462.7784 1466.7057 1468.9660 1474.9636 1475.0139 1479.9281 1527.8233 1530.8189 1586.4154 1586.4433 1607.5760 1607.6110 1639.0382 1722.7300 2930.9763 2931.3623 2960.0242 2963.3581 2967.2629 2967.5456 3024.5853 3025.3320 3098.3280 3108.0488 3128.7484 3128.7748 3139.9482 3140.0134 3150.5249 3150.6071 3160.0839 3160.1186 3169.6382 3169.6776
redmass: 3.6601 5.4761 4.8069 4.3786 3.7576 3.1886 1.7963 7.1364 1.5231 1.0335 5.3117 4.5646 4.4977 4.6556 2.7316 5.0099 3.8641 4.6397 2.6579 5.0223 4.0261 3.3407 5.2191 2.8273 2.8492 3.9192 4.7400 3.5469 2.7122 4.2672 5.7934 5.4141 5.2242 6.4517 6.4542 6.2755 5.6388 3.3597 3.3865 2.2173 1.7015 2.3963 2.2801 2.7044 4.9584 1.2474 1.2544 1.7375 3.8791 1.8894 1.4721 1.4549 1.8201 4.5827 4.6448 1.4621 1.5060 1.4643 1.3405 1.3411 3.9537 2.2020 1.4864 2.7079 1.6441 1.6302 1.5776 3.2669 3.1035 2.8354 2.5274 1.0580 1.0798 1.1473 1.1235 1.2767 1.1421 1.9933 4.7816 5.0502 1.3524 1.3769 2.0077 2.3688 9.0621 9.0481 1.3563 1.1998 2.2923 2.2983 1.1147 1.0696 1.0449 1.0509 1.0458 2.2425 2.2360 1.0782 10.6007 10.5667 6.3092 6.2562 6.0745 6.0395 7.9730 6.8167 1.0640 1.0635 1.0405 1.0423 1.0907 1.0907 1.0965 1.0964 1.0962 1.0923 1.0853 1.0853 1.0882 1.0882 1.0925 1.0924 1.0961 1.0961 1.1011 1.1012
irintensity: 0.4805 0.0736 7.0850 1.0558 0.2547 0.0068 0.1623 0.1041 5.7826 0.0092 3.0855 0.3918 1.3734 0.1380 1.7574 0.3283 1.2430 0.0913 13.3518 10.2164 0.4323 5.1391 1.6171 0.0465 0.8368 1.2164 0.3248 3.1808 0.4088 2.8237 15.7518 13.8756 1.1770 0.4101 0.7437 8.1846 6.3267 3.1155 0.1058 5.4206 200.0030 4.7270 27.3286 5.3459 18.7240 4.3116 0.1569 10.7590 25.0745 0.2080 2.7605 1.2154 0.2324 0.3870 1.7690 0.4744 2.1560 0.6145 0.0850 1.1939 9.6243 5.2950 2.6165 3.6215 0.0178 8.7439 10.7344 0.2424 27.3109 4.7504 21.8626 0.3367 0.0471 19.9599 12.8362 2.3481 1.2004 22.9671 255.5392 124.9353 13.2643 6.0980 3.8115 7.6318 0.0343 5.4163 13.5028 12.2862 29.9390 6.3468 4.7509 11.2051 0.0282 12.8655 25.7631 0.6055 0.6090 17.4687 9.4512 231.6302 9.9911 0.5486 19.4399 11.8499 51.3787 0.2687 49.9092 0.2124 66.5060 29.1140 2.1075 11.0239 0.0086 49.8156 13.9398 52.4846 0.8555 0.1956 3.0664 9.4171 9.3901 17.9433 13.3810 15.1170 20.8273 21.8377
temp: 298.150 k
press: 1.00000 atm
elementType: 8 8 6 6 6 6 6 6 6 6 6 6 6 6 6 6 6 6 6 6 6 6 6 6 1 1 1 1 1 1 1 1 1 1 1 1 1 1 1 1 1 1 1 1
symmnumber: 1
zpe: 922307.7 jmol-1
zpe.correction: 0.351288 hartree
zpe.thermalcorrener: 0.373543 hartree
zpe.thermalcorrenthalpy: 0.374488 hartree
zpe.thermalcorrgfe: 0.297397 hartree
zpe.sumelectzpe: -999.083826 hartree
zpe.sumelectthermal: -999.061571 hartree
zpe.sumelectthermalent: -999.060627 hartree
zpe.sumelectthermalfe: -999.137718 hartree
dipole: -0.5584 0.0074 0.0000
dipole: 0.5585
quadrupole: -114.6010 -136.4669 -146.7850
quadrupole: -0.0071 0.0037 -10.1135
quadrupole: 18.0166 -3.8493 -14.1673 -0.0071 0.0037 -10.1135
hfenergy: -999.4351143 hartree
pointgroup: C01 [X(C22H20O2)]
dipole: 0.0020678 0.2197053 0.0002621 debye
polarizability: 191.4416763|-0.3351886|285.7909528|-7.8240162|0.0021493|228.8732262 unknown
InChI: InChI=1S/C22H20O2/c1-15-13-19(21(23)17-9-5-3-6-10-17)20(14-16(15)2)22(24)18-11-7-4-8-12-18/h3-12H,13-14H2,1-2H3
charge 0 multiplicity 1
44 atoms
O  0.815082 -0.020161 2.51399
O  -0.819606 -0.029288 -2.514131
C  0.871565 -2.6105 1.210938
C  -0.85546 -2.618013 -1.208587
C  0.404413 -3.903985 0.560651
C  -0.375964 -3.907381 -0.559103
C  0.41965 -1.322001 0.544023
C  -0.413363 -1.32559 -0.542703
C  0.91124 -5.140064 1.281456
C  -0.870779 -5.147832 -1.280727
C  0.917153 -0.078989 1.246254
C  -0.919744 -0.086897 -1.246177
C  1.587607 1.023569 0.483101
C  -1.595826 1.01285 -0.483898
C  2.103857 0.837113 -0.827475
C  -2.110151 0.825189 0.827254
C  1.76219 2.278831 1.129061
C  -1.777786 2.266308 -1.131327
C  2.774326 1.892447 -1.482539
C  -2.786006 1.877632 1.481433
C  2.419648 3.333229 0.469218
C  -2.44064 3.317884 -0.472383
C  2.928926 3.14231 -0.840051
C  -2.947968 3.125803 0.837469
H  1.982995 -2.614523 1.270976
H  0.54743 -2.571417 2.273178
H  -1.966935 -2.631566 -1.266569
H  -0.533604 -2.576208 -2.271398
H  0.57507 -5.138094 2.337855
H  2.019572 -5.151508 1.306834
H  0.577201 -6.084754 0.82581
H  -0.528883 -6.089543 -0.824745
H  -0.533272 -5.142709 -2.336693
H  -1.978925 -5.169173 -1.307537
H  1.991672 -0.129797 -1.328252
H  -1.992116 -0.140405 1.329213
H  1.371153 2.397627 2.144975
H  -1.38806 2.386004 -2.14764
H  3.171976 1.740568 -2.491637
H  -3.182077 1.724837 2.491013
H  2.539986 4.301475 0.967406
H  -2.566657 4.284827 -0.971696
H  3.444374 3.962406 -1.352831
H  -3.467566 3.943689 1.349593
