program: Gaussian 09
title: 000293147
version: EM64L-G09RevD.01
frameworkgroup: C1[X(C11H14ClNO3S)]
method: RPBEPBE
basis: SDD
operation: Freq
keyword: #p
keyword: freq=noraman
keyword: PBEPBE/SDD
title: #p freq=noraman PBEPBE/SDD
converged: YES YES NO NO
title: Mulliken charges:
elementType: Cl S O O O N C C C C C C C C C C C H H H H H H H H H H H H H H
charge: -0.216886 0.899538 -0.236539 -0.459628 -0.462832 -0.454556 -0.038577 -0.570360 -0.683641 -0.708608 0.217566 0.510500 -0.424782 -0.315239 -0.134532 -0.183062 -0.206185 0.216389 0.216813 0.252204 0.218330 0.210228 0.237919 0.230596 0.227190 0.198842 0.317335 0.240713 0.325691 0.287889 0.287685
chargesum: 0.00000
title: Mulliken charges with hydrogens summed into heavy atoms:
elementType: Cl S O O O N C C C C C C C C C C C
charge: -0.216886 0.899538 -0.236539 -0.459628 -0.462832 -0.137221 0.177812 -0.101342 -0.017165 -0.051980 0.217566 0.510500 -0.184069 0.010452 -0.134532 0.104827 0.081499
polarizability: 3.04599627e+02 1.61130596e+01 1.43992438e+02 -6.41967823e+00 8.62988710e+00 1.51084739e+02
1716.lowfreq: -18.5771 -11.7167 -4.4670 -2.9902 -0.0019 -0.0015 0.0002 24.0682 27.8534
frequency: -11.0371 24.0448 27.6626 55.5137 60.2245 86.1488 100.2405 129.3098 173.1066 182.4795 190.0587 200.1216 214.4686 234.6949 245.8831 292.1015 311.8174 320.7659 357.7452 373.9745 376.1425 412.3067 414.8893 446.5756 461.6015 525.6005 552.9332 613.8787 646.3152 652.4170 718.5766 744.3614 783.8107 818.6876 824.2839 826.4565 863.5515 896.9234 919.1052 924.6579 958.8610 960.9208 963.1697 964.4764 977.4641 1002.7478 1046.4582 1065.4401 1100.9286 1122.8550 1179.4842 1184.5612 1188.6648 1248.4742 1259.3315 1269.6857 1294.2716 1329.3972 1345.6304 1368.9315 1383.4711 1403.5286 1411.9028 1457.1705 1464.6960 1471.3765 1472.2279 1483.5436 1486.3741 1496.1987 1585.5049 1594.0164 1627.1859 2966.5426 2972.3583 2983.5165 2990.8391 3058.1324 3068.8098 3075.2503 3080.0834 3087.1753 3132.4779 3164.4305 3170.9381 3196.0598 3525.9009
redmass: 4.3474 6.0181 5.2597 3.0765 6.3563 7.2911 6.0517 5.7439 6.5005 6.6095 5.2765 3.9322 1.3460 11.7110 1.0983 4.7004 7.4069 6.2683 2.1949 3.5209 4.3682 3.1918 5.7046 5.7990 2.9414 3.0047 4.0859 6.9462 3.7924 1.3685 3.2740 4.1017 3.7114 4.8454 7.2825 1.4612 1.4555 1.6412 3.7638 1.2586 2.6217 2.2230 2.0621 1.8282 5.6429 1.3199 2.4270 1.7059 1.4885 1.3016 2.0876 1.2598 1.9973 1.4659 1.4904 1.8077 1.4055 1.5098 1.3950 3.4464 1.2187 1.2153 5.1757 1.1708 1.0472 2.1092 1.0724 1.0617 1.0608 2.1074 6.8589 5.3736 4.7946 1.0371 1.0786 1.0381 1.0671 1.0986 1.0987 1.0992 1.0994 1.0994 1.0903 1.0913 1.0957 1.0955 1.0767
irintensity: 0.1594 0.2246 3.5305 0.2838 1.0944 4.1418 1.6268 4.3732 3.0799 5.2987 1.9235 0.8694 2.2216 1.2437 0.9076 8.7057 28.6758 10.9482 2.4256 21.8919 3.1433 4.6383 26.9549 96.7145 6.2492 69.1935 56.6768 1.7919 16.2931 49.3034 6.5168 12.2024 0.5077 16.9160 71.6818 42.3806 64.3539 0.8121 1.8519 3.9517 28.4531 19.7586 5.8573 3.3736 9.4454 3.7893 43.6433 68.4387 7.0916 12.6649 75.9575 45.8902 45.8945 16.9850 77.3368 32.5289 68.0254 3.1674 15.2051 245.0103 17.3711 14.4221 18.0267 18.0059 2.2473 29.8727 2.5508 65.2286 17.7643 431.5410 121.7692 71.2634 96.5508 29.4692 17.9946 33.9966 31.9491 34.3789 13.1346 20.7692 53.9857 60.7217 9.1822 5.5212 6.5660 17.0502 20.8459
temp: 298.150 k
press: 1.00000 atm
elementType: 17 16 8 8 8 7 6 6 6 6 6 6 6 6 6 6 6 1 1 1 1 1 1 1 1 1 1 1 1 1 1
symmnumber: 1
zpe: 613952.9 jmol-1
zpe.correction: 0.233842 hartree
zpe.thermalcorrener: 0.251584 hartree
zpe.thermalcorrenthalpy: 0.252528 hartree
zpe.thermalcorrgfe: 0.186226 hartree
zpe.sumelectzpe: -1564.697856 hartree
zpe.sumelectthermal: -1564.680115 hartree
zpe.sumelectthermalent: -1564.679170 hartree
zpe.sumelectthermalfe: -1564.745472 hartree
dipole: -9.3058 1.2426 4.0214
dipole: 10.2134
quadrupole: -134.1961 -122.3371 -113.8153
quadrupole: -6.1019 -7.5317 1.4577
quadrupole: -10.7466 1.1124 9.6342 -6.1019 -7.5317 1.4577
hfenergy: -1564.9316987 hartree
pointgroup: C01 [X(C11H14Cl1N1O3S1)]
dipole: 3.6367394 -1.4252875 0.9429505 debye
polarizability: 302.9574459|8.3230656|156.1592741|22.4112796|-3.3794456|140.5600841 unknown
InChI: InChI=1S/C11H14NO3S.Cl/c1-8(2)7-11(13)12-9-3-5-10(6-4-9)16(14)15;/h3-6,8,12H,7H2,1-2H3;
charge 0 multiplicity 1
31 atoms
Cl -4.535468 -0.587304 -2.397687
S  -4.352105 0.107759 -0.074235
O  2.461019 1.738722 0.23606
O  -4.797025 1.662094 -0.005287
O  -5.092086 -1.030547 0.808309
N  1.630551 -0.396781 0.744392
C  4.847176 -0.458212 -0.383315
C  4.063421 -0.001784 0.895492
C  5.112767 0.717657 -1.351124
C  4.152847 -1.637494 -1.104917
C  2.669068 0.545387 0.598558
C  0.243716 -0.225396 0.532953
C  -0.595837 -1.357445 0.7516
C  -0.32679 1.015487 0.124087
C  -2.506613 -0.02591 0.161424
C  -1.983889 -1.26936 0.558819
C  -1.717349 1.112143 -0.0731
H  5.826982 -0.819621 -0.007851
H  4.010905 -0.850042 1.606656
H  4.628323 0.813075 1.381879
H  5.656047 1.537717 -0.847768
H  5.721213 0.377059 -2.208903
H  4.169866 1.138555 -1.742631
H  4.785646 -2.007336 -1.93166
H  3.184929 -1.330257 -1.543389
H  3.971771 -2.489265 -0.420024
H  1.924051 -1.334994 1.027353
H  -0.15986 -2.311402 1.071175
H  0.323422 1.877289 -0.033263
H  -2.638714 -2.128856 0.729088
H  -2.174183 2.056965 -0.383092
