program: Gaussian 09
title: 000293229
version: EM64L-G09RevD.01
frameworkgroup: C1[X(C20H19Br3O4)]
method: RPBEPBE
basis: SDD
operation: Freq
keyword: #p
keyword: freq=noraman
keyword: PBEPBE/SDD
title: #p freq=noraman PBEPBE/SDD
converged: YES YES NO NO
title: Mulliken charges:
elementType: Br Br Br O O O O C C C C C C C C C C C C C C C C C C C C H H H H H H H H H H H H H H H H H H H
charge: -0.011288 0.049866 0.039982 -0.288202 -0.291264 -0.195581 -0.187303 0.015732 0.311939 0.407344 0.380635 0.438439 0.581306 -0.557316 -0.690487 -0.660685 0.444095 0.355725 -0.640161 -0.823040 -0.861758 -0.837425 -0.822992 0.283405 0.255396 -0.752536 -0.745842 0.244818 0.250929 0.263682 0.260631 0.261266 0.230272 0.245530 0.251912 0.254545 0.228783 0.255191 0.249105 0.263511 0.259745 0.260175 0.251538 0.251430 0.252180 0.266774
chargesum: 0.00000
title: Mulliken charges with hydrogens summed into heavy atoms:
elementType: Br Br Br O O O O C C C C C C C C C C C C C C C C C C C C
charge: -0.011288 0.049866 0.039982 -0.288202 -0.291264 -0.195581 -0.187303 0.015732 0.311939 0.407344 0.380635 0.438439 0.581306 -0.557316 -0.445669 -0.660685 0.444095 0.355725 -0.640161 -0.047797 -0.124691 -0.102185 -0.055185 0.283405 0.255396 0.018921 0.024543
polarizability: 3.51531292e+02 7.08438872e+00 2.87106826e+02 4.18323939e-01 9.40408178e+00 2.24159717e+02
1716.lowfreq: -8.3004 -2.8735 0.0001 0.0004 0.0006 3.1737 21.1503 22.9221 29.1135
frequency: 21.1060 22.8859 29.0715 32.0569 35.0493 50.6927 57.9011 59.4317 63.4282 78.0984 83.6987 85.6783 88.6316 113.7733 114.2191 123.3798 131.1932 136.4119 147.0068 153.7989 160.0619 189.3327 194.2716 204.0224 213.6765 224.2432 239.2517 256.5301 266.2546 280.0368 291.4051 301.5905 319.8815 344.2166 354.0607 373.1389 384.6476 407.8562 454.6062 492.2522 522.4528 532.4344 537.3017 540.8274 547.8690 560.8449 569.1460 575.5820 577.8653 605.8624 635.5542 659.6888 701.5690 710.3647 735.3370 752.4975 790.7789 794.9690 842.6856 872.7196 881.6530 942.6556 959.1194 982.5407 984.6123 990.5046 1018.6554 1025.5925 1030.8281 1039.6516 1040.8305 1041.6299 1043.1981 1043.6026 1044.2783 1049.5326 1102.7959 1145.0144 1161.2551 1175.1208 1225.9001 1290.2619 1320.0947 1326.7013 1340.5312 1360.3634 1378.2315 1383.6480 1385.7214 1394.5591 1398.3553 1401.1330 1402.8760 1405.4291 1442.8583 1451.1574 1451.6766 1451.9635 1452.3762 1455.9262 1460.2382 1461.9456 1469.6479 1471.3227 1473.1794 1474.9747 1484.7215 1526.8397 1557.0919 1583.4426 1600.1522 1691.8627 1694.3602 2978.2098 2981.7463 2993.9633 2994.6016 3009.0204 3009.0351 3057.3216 3060.5449 3071.0767 3071.2179 3085.4194 3090.0662 3097.6036 3097.9227 3122.1842 3122.6299 3126.0331 3145.5416 3146.2969
redmass: 10.3523 11.0418 6.0715 6.4504 6.7889 5.5606 2.1110 2.3362 6.4371 4.5282 2.2025 1.6171 1.5499 1.4058 4.4652 3.8433 10.0208 3.7456 1.0774 1.1532 1.0375 4.4017 2.7518 27.7895 6.1202 5.3565 6.5632 5.4447 4.0794 5.7052 4.5941 2.7997 3.4351 3.4114 5.3936 4.9164 5.0907 6.8839 5.0326 4.6684 3.6186 3.2292 4.6749 3.2211 3.4538 5.6405 8.2038 5.0246 5.3369 5.3127 5.7494 5.7098 6.7739 6.7234 6.5757 4.7600 7.2627 8.4605 8.6210 1.3117 6.6056 2.6123 3.2730 2.5357 2.2213 4.5284 1.6713 1.7851 1.9709 1.6173 1.5464 1.6252 1.5534 1.5221 1.5869 1.5754 6.4110 3.7548 3.0953 4.7655 1.6172 6.1346 7.4499 8.3086 7.2328 8.8888 5.2168 1.2468 1.2425 2.1752 1.2242 1.2606 1.3368 1.4153 2.1019 1.0509 1.0662 1.0688 1.0546 1.2259 1.0562 1.0450 1.0533 1.1242 1.0599 1.2520 1.3645 5.0241 6.5518 11.3489 6.6173 10.4658 10.5024 1.0371 1.0370 1.0386 1.0395 1.0373 1.0369 1.0975 1.0970 1.0972 1.0967 1.0991 1.0997 1.0964 1.0970 1.0977 1.0971 1.0913 1.1015 1.1014
irintensity: 0.2549 0.1302 0.2441 0.2708 0.5457 1.1340 4.4777 1.6744 1.3847 0.8058 0.1914 0.5073 0.6373 0.6767 1.1528 0.7899 0.1761 2.3218 0.5468 2.0157 0.0353 0.0271 4.4048 0.0231 0.8374 0.4347 0.3218 6.2469 2.5792 1.0646 2.2958 0.4071 0.5482 0.1100 0.9324 1.0864 3.3535 2.3263 15.5729 3.8235 0.4794 1.5567 0.6063 1.3674 5.6777 13.1284 6.7345 18.9566 5.0461 18.8136 10.9917 0.4916 12.7687 8.4851 31.0545 3.7668 22.4891 22.6260 50.7852 16.6536 125.4225 1.5227 17.8297 38.7443 152.3685 134.3274 24.4061 80.7546 2.2829 2.5993 9.9859 9.7252 1.6664 2.6489 1.0379 15.6329 135.1666 392.0478 153.4909 143.4938 8.5086 3.2446 4.0924 33.9638 7.6900 107.6907 14.6288 48.0914 61.1207 46.3487 15.8925 9.1964 3.8492 19.0133 11.9871 7.9458 17.0307 21.1446 21.0800 28.4904 16.4661 8.6735 9.4755 7.8079 29.0644 21.5660 23.0172 8.8385 4.8165 1.0335 4.1956 4.9084 251.7770 25.6407 25.0078 11.8681 6.9940 0.8107 0.7051 9.0423 12.1785 7.5576 6.6851 25.1744 19.7001 5.1041 4.4569 11.4671 13.8857 18.7742 8.2228 6.8245
temp: 298.150 k
press: 1.00000 atm
elementType: 35 35 35 8 8 8 8 6 6 6 6 6 6 6 6 6 6 6 6 6 6 6 6 6 6 6 6 1 1 1 1 1 1 1 1 1 1 1 1 1 1 1 1 1 1 1
symmnumber: 1
zpe: 880919.6 jmol-1
zpe.correction: 0.335525 hartree
zpe.thermalcorrener: 0.366258 hartree
zpe.thermalcorrenthalpy: 0.367202 hartree
zpe.thermalcorrgfe: 0.268961 hartree
zpe.sumelectzpe: -1112.862420 hartree
zpe.sumelectthermal: -1112.831686 hartree
zpe.sumelectthermalent: -1112.830742 hartree
zpe.sumelectthermalfe: -1112.928983 hartree
dipole: 1.7497 0.5273 3.6876
dipole: 4.1156
quadrupole: -168.2267 -165.7997 -191.8074
quadrupole: -14.6578 -5.8311 1.6214
quadrupole: 7.0512 9.4783 -16.5295 -14.6578 -5.8311 1.6214
hfenergy: -1113.1979444 hartree
pointgroup: C01 [X(C20H19Br3O4)]
dipole: -0.3714357 -0.0799394 1.5739923 debye
polarizability: 338.3910041|20.7294294|289.801193|-18.3809339|-27.0334394|234.6056374 unknown
InChI: InChI=1S/C20H19Br3O4/c1-8-7-9(2)16(21)10(3)14(8)15-18(23)19(26-12(5)24)11(4)17(22)20(15)27-13(6)25/h7H,1-6H3
charge 0 multiplicity 1
46 atoms
Br 4.121434 1.67539 -2.673212
Br -0.891143 2.838992 0.148391
Br -2.123452 -3.715928 0.749069
O  0.596094 -2.286366 0.653614
O  -3.625107 1.424444 0.372769
O  0.949347 -2.472252 -1.660425
O  -3.731734 1.455586 -1.974646
C  1.296527 0.457086 0.270056
C  -0.139398 0.022034 0.327768
C  1.897922 0.787991 -0.983183
C  2.036338 0.534175 1.486471
C  -0.460159 -1.353247 0.481308
C  4.030365 1.29609 0.220946
C  3.255874 1.200164 -0.96008
C  3.383622 0.952403 1.434437
C  -1.228661 0.924493 0.283609
C  -2.887599 -0.901749 0.496417
C  -2.566562 0.473493 0.358345
C  -1.794818 -1.80103 0.560909
C  1.122259 0.708943 -2.281955
C  1.401182 0.184962 2.820172
C  5.476805 1.744399 0.22817
C  -4.326518 -1.361282 0.569983
C  1.277292 -2.784713 -0.506247
C  -4.123642 1.902689 -0.88641
C  2.390869 -3.698866 -0.064559
C  -5.14141 2.985483 -0.632636
H  3.955777 1.022124 2.367049
H  1.049503 1.705907 -2.754427
H  1.630318 0.042428 -3.000797
H  0.105987 0.318493 -2.130283
H  1.143914 -0.889607 2.869964
H  2.086219 0.409733 3.654937
H  0.466123 0.751593 2.985336
H  6.107296 1.083358 -0.394821
H  5.583622 2.762979 -0.188469
H  5.881984 1.745548 1.25392
H  -4.486263 -2.015395 1.445181
H  -5.010778 -0.503406 0.643105
H  -4.592892 -1.950315 -0.32696
H  2.000376 -4.467376 0.623688
H  3.151253 -3.116355 0.48513
H  2.852366 -4.172708 -0.942313
H  -5.876351 2.659114 0.121865
H  -5.64797 3.247944 -1.572255
H  -4.630608 3.877756 -0.228531
