program: Gaussian 09
title: 000293124
version: EM64L-G09RevD.01
frameworkgroup: C1[X(C12H10N2O6)]
method: RPBEPBE
basis: SDD
operation: Freq
keyword: #p
keyword: freq=noraman
keyword: PBEPBE/SDD
title: #p freq=noraman PBEPBE/SDD
converged: YES YES NO NO
title: Mulliken charges:
elementType: O O O O O O N N C C C C C C C C C C C C H H H H H H H H H H
charge: -0.294039 -0.228902 -0.180403 -0.184137 -0.181966 -0.181416 0.023425 0.021409 -0.082677 -0.394009 0.288140 -0.466824 -0.483243 0.432405 0.438030 0.209175 -0.487482 -0.684742 0.241951 -0.483643 0.261883 0.227150 0.220393 0.331530 0.330902 0.341366 0.236963 0.228021 0.214579 0.286161
chargesum: 0.00000
title: Mulliken charges with hydrogens summed into heavy atoms:
elementType: O O O O O O N N C C C C C C C C C C C C
charge: -0.294039 -0.228902 -0.180403 -0.184137 -0.181966 -0.181416 0.023425 0.021409 0.179206 0.053534 0.288140 -0.135293 -0.152342 0.432405 0.438030 0.209175 -0.146117 -0.005179 0.241951 -0.197482
polarizability: 2.33123258e+02 3.63548465e+00 1.81820488e+02 8.42717098e+00 1.77225627e+00 1.05232896e+02
1716.lowfreq: -6.8549 -0.0006 -0.0004 0.0004 3.1132 4.3907 11.4957 33.4173 47.6261
frequency: 11.2221 33.3982 47.6232 50.3318 51.8446 52.8064 96.4399 112.5164 133.2427 144.1198 163.7790 192.1860 198.0887 220.9331 239.7093 253.6795 286.1410 309.9332 332.7071 352.2276 397.1926 456.5620 465.7470 481.9409 503.3622 521.8009 555.6717 606.4225 636.1794 640.1779 681.1686 683.7007 686.3893 698.1372 724.6048 740.3916 745.4520 775.2997 840.8566 864.2153 868.3500 909.8120 954.4849 976.2089 979.9565 987.4748 990.8813 1052.4338 1069.1733 1086.7624 1101.7474 1117.2310 1141.4534 1205.6731 1207.6129 1233.6032 1242.5541 1252.3183 1279.4719 1327.5376 1334.4656 1380.5715 1384.0331 1400.3825 1406.0445 1435.4052 1460.4618 1471.5300 1479.3567 1488.3540 1588.0250 1617.1833 1630.1207 2144.1905 2988.3675 3008.1944 3015.0563 3064.8576 3088.5946 3095.3886 3179.4709 3191.9756 3197.7296 3424.0877
redmass: 4.6520 7.0887 8.4223 15.4282 13.9686 5.4795 2.7618 8.3347 4.6047 6.2384 2.7423 4.5535 4.9272 4.9759 1.4285 3.8527 5.7649 8.7894 11.9302 11.5477 5.2916 7.0818 5.6871 6.4595 9.2104 3.5735 6.6830 5.4053 6.4268 1.2286 5.2999 11.2227 1.4088 2.8470 9.1124 6.4817 8.9669 1.5273 4.1899 3.7841 7.0191 3.9930 1.8410 1.4406 1.6020 6.2673 1.3983 2.8234 1.5843 1.7006 1.7688 2.8804 2.5107 9.9907 11.7706 1.2251 1.4943 2.2650 1.4812 1.4654 1.3475 10.5415 10.3187 1.2029 5.6304 5.5878 4.2741 1.0663 1.0408 1.0657 8.2432 8.1883 11.6014 6.0078 1.0363 1.0646 1.0794 1.1014 1.1004 1.1011 1.0928 1.0928 1.0931 1.1606
irintensity: 0.0088 0.0405 0.4241 0.0070 0.0072 0.0747 0.5895 8.9772 1.9225 2.0148 4.7209 0.6094 0.1088 0.1103 2.7549 3.9332 1.0412 6.4397 0.2607 3.3105 4.5100 3.7923 0.1441 3.5769 4.6445 6.7490 5.6682 2.5009 2.4551 64.2880 38.8283 42.9144 31.3754 43.0012 0.0070 8.7450 16.9485 2.6373 64.1086 8.1249 9.9600 176.4933 30.4216 16.8424 26.6379 1.6679 3.9703 42.4157 133.3041 14.5952 153.0064 130.3726 1.0357 226.0150 366.5586 0.2083 6.5282 54.6340 53.5076 1.2020 14.9444 41.1322 144.7108 12.7381 10.3468 20.8440 29.2941 4.3311 11.3282 12.5894 4.9399 14.4342 164.6791 3.4003 29.4456 12.4297 16.5780 1.6400 37.4208 37.8361 15.9280 26.8780 10.0684 65.7610
temp: 298.150 k
press: 1.00000 atm
elementType: 8 8 8 8 8 8 7 7 6 6 6 6 6 6 6 6 6 6 6 6 1 1 1 1 1 1 1 1 1 1
symmnumber: 1
zpe: 540991.9 jmol-1
zpe.correction: 0.206053 hartree
zpe.thermalcorrener: 0.225378 hartree
zpe.thermalcorrenthalpy: 0.226322 hartree
zpe.thermalcorrgfe: 0.154850 hartree
zpe.sumelectzpe: -1022.446572 hartree
zpe.sumelectthermal: -1022.427247 hartree
zpe.sumelectthermalent: -1022.426303 hartree
zpe.sumelectthermalfe: -1022.497775 hartree
dipole: 5.4977 0.3692 -0.3574
dipole: 5.5217
quadrupole: -118.9948 -142.0804 -105.6287
quadrupole: 0.1090 0.1995 -0.8458
quadrupole: 3.2398 -19.8457 16.6059 0.1090 0.1995 -0.8458
hfenergy: -1022.6526245 hartree
pointgroup: C01 [X(C12H10N2O6)]
dipole: 2.1580077 0.1899925 -0.1620135 debye
polarizability: 233.2821874|3.7241091|180.8509368|6.477992|9.2011028|106.0435177 unknown
InChI: InChI=1S/C12H10N2O6/c1-3-11(4-2)20-12(15)8-5-9(13(16)17)7-10(6-8)14(18)19/h1,5-7,11H,4H2,2H3
charge 0 multiplicity 1
30 atoms
O  2.142142 0.075368 -0.217507
O  1.501943 -2.169842 -0.413817
O  -3.396204 -3.116469 -0.401726
O  -1.085657 3.611919 0.407515
O  -4.895957 -1.418386 -0.122117
O  -3.323002 3.16132 0.437391
N  -3.696649 -1.876951 -0.225345
N  -2.088741 2.80634 0.341633
C  3.609194 -0.31573 -0.272164
C  4.299434 0.749585 -1.147699
C  -0.188515 -0.435847 -0.157491
C  -0.457834 0.938963 0.035777
C  -1.24999 -1.367009 -0.243106
C  -2.572575 -0.898746 -0.1343
C  -1.798994 1.35632 0.138652
C  1.213289 -0.959363 -0.273837
C  -2.881668 0.461083 0.05737
C  5.801803 0.454513 -1.344883
C  4.120037 -0.392378 1.104214
C  4.567082 -0.458457 2.250257
H  3.659094 -1.315826 -0.744882
H  4.16117 1.741293 -0.680597
H  3.780567 0.766611 -2.124022
H  0.354583 1.665447 0.107053
H  -1.041357 -2.430838 -0.390243
H  -3.915725 0.805351 0.139463
H  6.339137 0.455246 -0.380376
H  6.258736 1.224878 -1.990153
H  5.962592 -0.527782 -1.826463
H  4.950765 -0.522011 3.252704
