program: Gaussian 09
title: 000293252
version: EM64L-G09RevD.01
frameworkgroup: C1[X(C22H22Cl2N2O4S2)]
method: RPBEPBE
basis: SDD
operation: Freq
keyword: #p
keyword: freq=noraman
keyword: PBEPBE/SDD
title: #p freq=noraman PBEPBE/SDD
converged: YES YES NO NO
title: Mulliken charges:
elementType: Cl Cl S S O O O O N N C C C C C C C C C C C C C C C C C C C C C C H H H H H H H H H H H H H H H H H H H H H H
charge: -0.010968 -0.010890 0.914235 0.914212 -0.537438 -0.527444 -0.537263 -0.527479 -0.344935 -0.344855 0.244170 0.243961 0.474171 0.474557 -0.460529 -0.460590 -0.807798 -0.807924 -0.636501 -0.636300 -0.023878 -0.024110 -0.261851 -0.223203 -0.261852 -0.223113 -0.207730 -0.236851 -0.207781 -0.236833 -0.224258 -0.224382 0.266291 0.242467 0.257743 0.266384 0.242470 0.257760 0.239169 0.240767 0.275334 0.239319 0.240775 0.275003 0.282424 0.325169 0.282339 0.325384 0.240534 0.262415 0.240516 0.262492 0.238350 0.238345
chargesum: 0.00000
title: Mulliken charges with hydrogens summed into heavy atoms:
elementType: Cl Cl S S O O O O N N C C C C C C C C C C C C C C C C C C C C C C
charge: -0.010968 -0.010890 0.914235 0.914212 -0.537438 -0.527444 -0.537263 -0.527479 -0.344935 -0.344855 0.244170 0.243961 0.474171 0.474557 -0.460529 -0.460590 -0.041297 -0.041310 0.118768 0.118796 -0.023878 -0.024110 0.020573 0.101966 0.020488 0.102271 0.032804 0.025564 0.032735 0.025659 0.014092 0.013963
polarizability: 4.32229617e+02 5.82229516e+00 3.58856549e+02 -9.43217205e-03 -7.14589698e-02 2.70376989e+02
1716.lowfreq: -10.9581 -4.6572 -3.8155 -0.0024 -0.0019 0.0009 18.8803 29.3309 34.1181
frequency: 18.8538 29.2848 34.0864 43.4961 45.8912 56.3896 62.7481 65.0162 67.9717 75.3740 83.1818 107.5568 112.7009 125.4409 127.1081 147.4583 148.9334 156.6136 163.8567 171.2842 176.1252 180.8532 185.4792 196.1245 209.8432 226.3477 226.8811 232.2025 243.3332 248.6134 248.8534 256.7850 275.7568 302.6329 307.1527 314.9121 332.6698 343.5537 346.1990 366.2955 371.2516 371.7778 373.3808 405.8059 407.1125 449.6192 451.7702 456.3988 475.4482 497.8174 500.8940 514.1038 534.0193 588.5517 599.8922 600.5801 645.6656 656.8717 658.5082 682.4123 690.7704 692.4126 695.0396 762.4947 763.8477 770.7403 796.2032 796.8076 831.6319 843.1426 854.0748 857.2077 921.6945 924.3504 939.6258 942.8499 950.2892 975.2426 975.8072 985.1651 988.4291 990.6123 1005.6806 1005.8512 1009.7463 1011.1901 1027.8904 1043.2308 1043.2716 1044.4912 1048.9132 1054.0415 1080.6932 1081.6457 1085.0477 1089.6979 1138.4085 1139.0903 1149.7581 1172.4917 1172.6079 1179.6727 1181.3606 1197.7188 1287.0966 1303.5475 1304.0499 1310.0656 1340.8774 1380.7760 1381.0562 1386.0673 1386.4005 1402.4303 1424.1206 1428.6309 1430.5298 1435.0484 1435.6227 1450.3149 1450.5637 1455.4917 1464.4092 1465.8223 1469.4125 1469.9401 1470.5428 1475.5288 1503.0471 1550.2017 1572.3200 1572.9127 1599.9339 1600.3494 2956.7968 2957.1609 2990.9226 2990.9722 3038.9502 3039.3119 3068.2983 3068.3808 3085.1128 3085.5947 3125.4117 3125.5759 3137.5218 3137.5959 3144.4218 3145.3404 3152.9599 3153.1304 3165.1177 3165.2182 3174.7964 3175.0347
redmass: 6.2055 6.4663 6.1169 8.3992 7.5010 4.8032 6.0632 6.7430 4.3016 5.2543 8.7937 1.3597 1.3968 4.4592 4.0365 3.8008 5.2638 4.4615 2.0922 1.3726 1.5442 2.6114 3.7462 7.1186 6.2815 3.6700 5.4642 4.5729 8.1169 5.7447 7.8874 4.8686 3.6101 13.4029 5.7256 4.3642 4.4847 7.3894 6.7141 5.5054 7.4713 8.4381 6.9519 2.8483 2.8692 8.0725 5.5973 6.1289 7.2864 4.5128 4.8782 5.4088 5.8037 5.0349 6.4639 6.4540 4.8457 7.1042 6.9117 5.3883 2.4555 2.5563 7.0313 1.4211 1.3797 5.6046 16.0219 16.2646 5.4288 8.3879 1.2444 1.2375 16.0925 17.5359 1.3494 1.3586 6.8455 6.2489 5.9392 1.6861 1.3882 1.4056 3.8244 3.8947 1.3871 1.3770 1.5292 2.0285 1.8816 1.7233 1.4874 3.7216 1.5614 1.5548 1.2752 1.4146 1.6429 1.4798 4.6919 1.0577 1.0573 1.1140 1.1171 7.5550 9.8011 1.2985 1.2982 7.4632 6.2920 8.0015 8.1801 1.2552 1.2150 5.2567 1.2182 1.2292 1.3435 2.2332 2.1786 2.0194 2.0185 1.0950 1.0559 1.0533 1.0675 1.0530 1.0802 1.0605 2.4784 9.7774 5.8856 5.8411 6.8079 6.7983 1.0338 1.0337 1.0384 1.0385 1.0985 1.0986 1.0965 1.0965 1.1005 1.1004 1.0982 1.0982 1.0862 1.0861 1.0911 1.0906 1.0921 1.0923 1.0965 1.0965 1.1013 1.1013
irintensity: 1.5213 2.2941 0.0182 0.0106 4.3991 0.6346 0.2761 0.0871 0.7115 1.3692 0.0123 1.8551 1.3419 1.3512 2.0607 0.0705 0.0899 6.5974 0.6072 0.6180 5.4606 2.4514 4.6165 1.2906 0.3244 4.7861 4.4471 4.2573 11.7571 0.4633 6.9403 2.7768 3.1105 2.6590 0.3821 1.8984 0.2825 0.6405 0.1327 27.7638 9.8885 1.3860 6.3024 0.1631 0.1620 65.4644 20.3566 29.5770 27.4790 10.8101 111.6202 22.0037 22.1298 0.2311 0.7291 0.2578 3.5731 2.6501 10.4450 5.6794 6.3300 40.4744 6.4131 14.9312 122.3285 27.0513 30.5775 96.5337 36.5994 29.9861 2.7558 0.6110 150.8896 0.3584 0.1515 2.1456 10.4786 1.6684 4.4608 38.2518 0.5694 0.4272 1.3470 1.4076 0.8022 0.0872 7.5911 7.6543 23.9464 3.8189 0.7449 74.3218 11.9410 0.1241 30.8664 11.6323 17.4346 10.6835 0.1668 2.0581 0.6669 1.5581 0.5495 9.3977 1.4628 12.8922 0.4852 9.2450 6.5415 0.0630 13.3708 35.5712 6.4340 43.9438 1.4581 40.4210 1.0910 30.8647 0.0216 18.6568 6.7037 18.9427 3.8027 35.7018 22.1715 19.3113 8.6778 11.1610 1.8828 4.0047 2.2244 1.0046 0.8382 0.0128 37.0692 42.0535 7.9318 16.7620 11.8053 8.4852 5.0951 9.6703 18.9147 17.6202 6.3910 2.0338 7.1008 2.1537 57.7889 10.2170 1.2128 0.1656 2.4843 0.1580 45.9961 12.7999
temp: 298.150 k
press: 1.00000 atm
elementType: 17 17 16 16 8 8 8 8 7 7 6 6 6 6 6 6 6 6 6 6 6 6 6 6 6 6 6 6 6 6 6 6 1 1 1 1 1 1 1 1 1 1 1 1 1 1 1 1 1 1 1 1 1 1
symmnumber: 1
zpe: 1025842.2 jmol-1
zpe.correction: 0.390723 hartree
zpe.thermalcorrener: 0.424933 hartree
zpe.thermalcorrenthalpy: 0.425877 hartree
zpe.thermalcorrgfe: 0.324251 hartree
zpe.sumelectzpe: -2975.494961 hartree
zpe.sumelectthermal: -2975.460750 hartree
zpe.sumelectthermalent: -2975.459806 hartree
zpe.sumelectthermalfe: -2975.561433 hartree
dipole: 0.0097 0.0059 -2.1001
dipole: 2.1001
quadrupole: -190.7805 -220.7028 -210.4168
quadrupole: -28.4485 0.0629 0.0149
quadrupole: 16.5196 -13.4028 -3.1168 -28.4485 0.0629 0.0149
hfenergy: -2975.8856833 hartree
pointgroup: C01 [X(C22H22Cl2N2O4S2)]
dipole: -0.0116758 -0.0104813 -0.8260894 debye
polarizability: 432.6128273|2.128276|358.451303|-1.5316246|-0.839928|270.3990247 unknown
InChI: InChI=1S/C22H22Cl2N2O4S2/c1-15-19(23)22(26(4)32(29,30)18-13-9-6-10-14-18)16(2)20(24)21(15)25(3)31(27,28)17-11-7-5-8-12-17/h5-14H,1-4H3
charge 0 multiplicity 1
54 atoms
Cl 0.526354 3.149924 -1.945996
Cl -0.554901 -3.183931 -1.873567
S  -2.666272 -1.272045 0.552583
S  2.679406 1.286514 0.481623
O  -1.162919 -1.653939 1.074114
O  -3.938645 -2.263305 0.806173
O  1.185125 1.682197 1.018871
O  3.957891 2.279431 0.694633
N  -2.697266 -0.856035 -1.449107
N  2.676786 0.830322 -1.512077
C  -1.368743 -0.487015 -1.800424
C  1.342394 0.454839 -1.832986
C  -1.111858 0.925446 -1.906294
C  1.083948 -0.959547 -1.905423
C  0.232443 1.348271 -1.923844
C  -0.260351 -1.382285 -1.891763
C  -2.253716 1.915971 -1.96066
C  2.224783 -1.951284 -1.95897
C  -3.494211 -1.87092 -2.172044
C  3.461692 1.830337 -2.267853
C  -3.063274 0.426028 1.272954
C  3.085043 -0.398692 1.228228
C  -4.416489 0.737457 1.484102
C  -1.993366 1.283877 1.579534
C  4.441227 -0.710186 1.419676
C  2.019046 -1.24775 1.5705
C  -4.713886 2.002097 2.041919
C  -2.318226 2.546466 2.130431
C  4.745946 -1.965545 1.994295
C  2.351095 -2.501324 2.137526
C  -3.668243 2.902546 2.358933
C  3.704221 -2.857371 2.346572
H  -3.213602 1.383997 -1.900034
H  -2.209249 2.498068 -2.899841
H  -2.194862 2.64231 -1.131017
H  3.185471 -1.418505 -1.923574
H  2.165619 -2.551155 -2.886086
H  2.178823 -2.661584 -1.114778
H  -4.149018 -1.328364 -2.880393
H  -2.899371 -2.624269 -2.713026
H  -4.14483 -2.389509 -1.439706
H  4.093794 1.273998 -2.986163
H  2.859521 2.582343 -2.802639
H  4.134945 2.351627 -1.558414
H  -5.200075 0.01185 1.243873
H  -0.948365 1.005312 1.406469
H  5.222116 0.00863 1.15184
H  0.971614 -0.969461 1.413096
H  -5.75676 2.27821 2.22958
H  -1.507328 3.239545 2.375211
H  5.791488 -2.241215 2.16716
H  1.543154 -3.187513 2.409944
H  -3.90661 3.881054 2.78988
H  3.948189 -3.82892 2.789952
