program: Gaussian 09
title: 000293044
version: EM64L-G09RevD.01
frameworkgroup: C1[X(C11H12N2O3)]
method: RPBEPBE
basis: SDD
operation: Freq
keyword: #p
keyword: freq=noraman
keyword: PBEPBE/SDD
title: #p freq=noraman PBEPBE/SDD
converged: NO NO NO NO
title: Mulliken charges:
elementType: O O O N N C C C C C C C C C C C H H H H H H H H H H H H
charge: -0.306633 -0.207086 -0.208133 -0.092629 0.025885 0.351893 -0.563763 -0.713857 -0.714261 0.101472 0.324614 -0.338472 -0.331194 -0.352489 -0.352679 0.384061 0.242583 0.242667 0.213855 0.235476 0.234116 0.235378 0.213894 0.234218 0.285920 0.278418 0.288800 0.287948
chargesum: 0.00000
title: Mulliken charges with hydrogens summed into heavy atoms:
elementType: O O O N N C C C C C C C C C C C
charge: -0.306633 -0.207086 -0.208133 -0.092629 0.025885 0.351893 -0.078513 -0.030411 -0.030771 0.101472 0.324614 -0.052552 -0.052776 -0.063689 -0.064732 0.384061
polarizability: 2.50296879e+02 9.44749743e+00 1.42934695e+02 -1.05590357e-01 4.49389401e-02 7.80257718e+01
1716.lowfreq: -6.9631 -0.0010 0.0000 0.0003 4.2065 20.6018 30.6220 50.0544 64.0030
frequency: 30.0949 49.9986 63.8978 76.7779 89.5086 152.4640 191.0003 208.7782 229.7982 248.6383 268.8899 325.2680 328.7203 353.2504 410.8800 430.6977 461.9904 476.8654 476.9810 515.2139 602.9539 625.8265 636.1102 672.4641 688.3690 748.8859 757.1419 784.3723 824.1708 861.6566 868.7465 883.2978 914.1926 943.3208 953.9551 974.3077 999.9745 1002.6236 1005.3163 1009.4363 1027.9001 1087.7763 1107.1790 1143.6024 1147.4220 1174.9287 1212.6640 1231.6528 1259.3053 1274.8668 1292.9503 1328.6548 1359.5520 1381.0362 1396.1036 1404.3397 1414.6397 1451.8433 1460.6177 1462.5267 1469.8547 1477.3115 1484.5117 1582.9154 1601.9104 1615.5028 2986.2425 2989.5024 3000.9488 3051.8181 3082.3975 3088.0201 3096.3504 3100.4751 3166.9073 3171.8301 3188.3725 3191.5078
redmass: 3.7053 4.6507 6.9689 5.6192 5.3859 4.1144 1.0932 4.6693 1.4415 2.8219 4.7878 3.0174 2.5286 3.0415 2.9044 2.8406 4.2938 5.3381 4.6813 5.7791 4.4580 6.8934 6.2522 4.2948 8.2433 4.9379 7.6857 9.0671 3.9073 1.2445 5.8407 1.6299 1.6690 1.3154 2.3597 3.9847 1.3391 3.9666 1.3832 1.3598 3.7184 3.2485 1.2976 1.2414 2.2370 1.3173 5.6958 2.2843 2.3766 2.5412 1.2654 2.1366 8.3740 1.2451 1.2099 10.7975 3.8012 1.0516 1.1231 1.0481 1.0620 2.2624 1.1054 8.2849 8.4450 6.4822 1.0356 1.0368 1.0587 1.1056 1.0989 1.0987 1.1012 1.1005 1.0901 1.0892 1.0959 1.0973
irintensity: 0.0011 0.1017 0.0866 0.0437 0.5454 9.9114 0.0830 3.4627 0.8271 1.3887 0.0622 0.3378 3.3276 1.6684 0.0004 2.0860 2.9547 4.5526 2.7427 0.7861 2.9874 0.8644 7.8868 40.3163 6.9314 0.0946 38.2452 27.2646 31.2816 0.6738 1.6315 63.5988 0.0707 1.6622 38.2199 7.7074 0.3571 60.6031 0.2122 0.0045 141.3473 19.5483 17.2527 0.9042 25.9268 41.4545 407.7948 6.2008 76.5412 16.8002 0.0717 30.2124 88.0250 31.0070 16.4113 8.6759 59.4268 2.2340 13.2616 3.7225 10.1363 18.9179 6.5846 40.9894 13.7404 19.0352 14.8199 14.2080 41.4821 15.8585 6.2437 35.7465 10.2784 34.7890 0.8952 0.5157 0.1274 1.4082
temp: 298.150 k
press: 1.00000 atm
elementType: 8 8 8 7 7 6 6 6 6 6 6 6 6 6 6 6 1 1 1 1 1 1 1 1 1 1 1 1
symmnumber: 1
zpe: 562919.4 jmol-1
zpe.correction: 0.214405 hartree
zpe.thermalcorrener: 0.229018 hartree
zpe.thermalcorrenthalpy: 0.229962 hartree
zpe.thermalcorrgfe: 0.171638 hartree
zpe.sumelectzpe: -760.291538 hartree
zpe.sumelectthermal: -760.276925 hartree
zpe.sumelectthermalent: -760.275981 hartree
zpe.sumelectthermalfe: -760.334305 hartree
dipole: 7.5056 -0.4193 0.0050
dipole: 7.5173
quadrupole: -105.8318 -93.6340 -92.6374
quadrupole: -3.8392 0.0364 0.0202
quadrupole: -8.4641 3.7337 4.7304 -3.8392 0.0364 0.0202
hfenergy: -760.5059425 hartree
pointgroup: C01 [X(C11H12N2O3)]
dipole: -2.9485986 -0.2100249 -0.0928953 debye
polarizability: 250.5058117|-7.861824|142.1110865|3.3250877|5.772388|78.6404477 unknown
InChI: InChI=1S/C11H12N2O3/c1-11(2)7-12-10(16-11)8-3-5-9(6-4-8)13(14)15/h3-6H,7H2,1-2H3
charge 0 multiplicity 1
28 atoms
O  -2.238111 -0.801911 -0.133405
O  4.955937 0.886482 0.192338
O  4.741604 -1.378083 -0.018609
N  -2.129026 1.517636 0.092735
N  4.246184 -0.18782 0.07771
C  -3.705085 -0.368439 -0.131089
C  -3.58598 1.195819 0.025848
C  -4.297829 -0.802387 -1.47884
C  -4.368975 -1.053896 1.071214
C  -1.481316 0.382227 -0.00087
C  -0.015543 0.223237 0.019162
C  0.807077 1.375954 0.144962
C  0.573621 -1.064771 -0.086429
C  2.206116 1.248209 0.165046
C  1.973997 -1.205895 -0.067241
C  2.766628 -0.045051 0.058016
H  -4.036662 1.730432 -0.830307
H  -4.079412 1.555081 0.947427
H  -5.360899 -0.503279 -1.53518
H  -3.757723 -0.327824 -2.316366
H  -4.239094 -1.897694 -1.600438
H  -3.882646 -0.751266 2.014755
H  -5.436488 -0.770178 1.122608
H  -4.306321 -2.152037 0.981738
H  0.3257 2.354945 0.224666
H  -0.073593 -1.940613 -0.18258
H  2.865162 2.114576 0.260136
H  2.458377 -2.182252 -0.146408
