program: Gaussian 09
title: 000293138
version: EM64L-G09RevD.01
frameworkgroup: C1[X(C21H14N2O6)]
method: RPBEPBE
basis: SDD
operation: Freq
keyword: #p
keyword: freq=noraman
keyword: PBEPBE/SDD
title: #p freq=noraman PBEPBE/SDD
converged: YES YES NO NO
title: Mulliken charges:
elementType: O O O O O O N N C C C C C C C C C C C C C C C C C C C C C H H H H H H H H H H H H H H
charge: -0.206883 -0.209502 -0.286130 -0.181901 -0.193708 -0.240315 -0.348052 0.020263 0.139108 0.213326 0.192764 0.449914 0.017653 0.014824 0.421285 -0.360877 -0.360901 -0.434077 -0.433951 0.300849 -0.232853 -0.233659 -0.286273 -0.510754 0.267613 -0.349340 0.182873 -0.222445 -0.673044 0.282036 0.280014 0.248139 0.248194 0.241009 0.240475 0.260682 0.317161 0.279358 0.234514 0.233946 0.216622 0.230688 0.231350
chargesum: 0.00000
title: Mulliken charges with hydrogens summed into heavy atoms:
elementType: O O O O O O N N C C C C C C C C C C C C C C C C C C C C C
charge: -0.206883 -0.209502 -0.286130 -0.181901 -0.193708 -0.240315 -0.348052 0.020263 0.139108 0.213326 0.192764 0.449914 0.017653 0.014824 0.421285 -0.078842 -0.080886 -0.185938 -0.185756 0.300849 0.008157 0.006816 -0.025590 -0.193593 0.267613 -0.069982 0.182873 0.246016 0.005617
polarizability: 4.28409689e+02 -3.15149364e+00 2.55541985e+02 9.55082986e-01 -2.63433755e+01 1.71372077e+02
1716.lowfreq: -8.2834 -5.2581 -2.7493 -0.0006 0.0005 0.0010 16.1826 26.1679 28.8545
frequency: 16.1333 26.1656 28.8326 32.4085 54.2332 64.0855 74.5797 77.3912 101.7581 117.8579 139.4542 159.3894 166.7751 174.0099 178.8294 189.6069 235.3148 248.2268 276.7890 292.1022 310.7189 328.6296 358.8433 363.4941 376.4758 396.6983 417.9625 421.0969 422.4703 443.6008 469.6024 480.9885 515.3371 523.2625 540.0913 543.4285 569.2069 589.7147 614.0735 647.6770 663.6006 682.3659 686.5329 717.1129 735.1027 735.5663 744.9007 771.3169 784.2694 788.0069 797.7554 798.9786 800.9427 825.3851 846.0179 865.0801 886.1934 895.4661 942.1041 948.2307 963.6820 967.6598 989.4917 1003.3040 1008.4237 1022.6631 1028.3724 1060.6751 1077.3626 1087.6319 1098.6352 1113.1388 1131.4352 1136.8060 1147.2674 1157.2545 1191.6518 1194.8131 1209.3508 1228.9104 1229.9609 1250.8486 1253.7513 1265.0682 1274.0595 1324.0285 1360.2782 1369.5493 1384.1513 1386.8414 1401.5769 1411.3054 1414.6685 1429.8052 1439.5842 1459.1530 1464.1540 1473.1548 1485.7684 1491.9561 1519.3632 1567.9032 1581.9242 1583.4197 1590.4057 1612.2956 1623.9859 1626.3295 1634.6926 2996.7121 3012.8167 3071.7162 3093.3513 3108.4103 3133.2611 3134.8737 3154.2756 3155.1978 3168.3946 3171.5109 3172.3395 3178.0489 3189.4452
redmass: 4.6565 6.7809 4.7824 4.9786 12.2349 4.1229 6.5858 6.1366 3.6130 11.5182 4.7580 5.2795 5.4029 4.3839 7.1100 5.1355 3.9442 1.3335 6.0651 6.6378 7.7674 8.5710 8.2443 4.1519 7.4684 10.2222 5.4551 6.0153 4.7495 5.7083 3.3588 6.8734 4.9676 6.4047 6.1082 6.8890 6.9419 5.9226 3.5724 7.3885 7.3359 9.5939 7.2835 3.2086 5.4137 6.0164 4.4834 10.5727 6.3505 2.2773 1.1179 1.5126 4.7494 4.4210 1.6550 2.3461 4.2916 6.1303 6.2034 1.3547 1.4916 1.4545 1.3883 1.3766 1.3990 2.3226 3.5916 2.9741 1.8286 5.7355 3.8271 2.2404 2.2890 1.4721 1.6182 1.6541 1.2857 1.5329 4.9745 2.3511 2.5174 1.1294 2.7695 3.9117 1.5855 2.9286 1.4252 6.1369 6.2886 4.1839 1.2688 6.5164 5.7333 2.1187 8.6190 2.6091 1.0402 1.0621 1.1140 2.8964 4.8563 9.7053 7.8328 7.1691 7.7728 8.7444 11.0509 8.7933 7.8946 1.0358 1.0582 1.1066 1.0985 1.1029 1.0887 1.0881 1.0916 1.0916 1.0897 1.0985 1.0983 1.0921 1.0970
irintensity: 1.1851 2.0804 0.6833 0.6045 0.1693 0.8304 0.4667 0.2749 0.0380 1.2314 0.6680 2.4809 3.8895 6.6168 2.5644 4.1601 0.0056 1.1727 9.2904 6.7441 4.5340 1.2034 28.2949 10.1823 3.7852 5.5055 17.7339 7.5353 0.8611 1.0751 0.8130 5.5910 4.7039 6.0843 5.0770 0.8285 1.9519 2.1518 0.1876 6.5123 7.9461 11.6490 14.5879 0.5527 1.1041 11.2641 7.2291 15.6224 13.9378 80.1038 2.3730 0.4121 12.4742 2.9849 24.3267 45.8272 12.2463 28.4058 2.6280 0.0830 19.7376 0.1479 1.4288 0.0534 2.2092 68.3658 12.0840 5.9892 27.0753 348.7842 50.3283 3.9220 70.5481 5.8520 13.4454 40.4210 48.5634 26.4462 381.5746 35.0492 46.5521 0.0643 90.1723 141.9108 30.3033 402.3372 1.5288 100.5171 24.3796 2.6893 22.9670 0.2981 26.5586 26.3758 33.3571 4.2594 12.8847 5.7678 27.2861 28.9788 0.1074 108.6982 127.0308 69.6554 173.3797 9.4180 140.4235 182.5321 28.5611 20.5580 18.6100 5.5791 30.6589 41.8663 0.3592 5.5030 7.8071 10.8944 2.5257 14.7102 18.2727 10.1132 2.5548
temp: 298.150 k
press: 1.00000 atm
elementType: 8 8 8 8 8 8 7 7 6 6 6 6 6 6 6 6 6 6 6 6 6 6 6 6 6 6 6 6 6 1 1 1 1 1 1 1 1 1 1 1 1 1 1
symmnumber: 1
zpe: 809699.1 jmol-1
zpe.correction: 0.308398 hartree
zpe.thermalcorrener: 0.332563 hartree
zpe.thermalcorrenthalpy: 0.333507 hartree
zpe.thermalcorrgfe: 0.251854 hartree
zpe.sumelectzpe: -1367.450355 hartree
zpe.sumelectthermal: -1367.426190 hartree
zpe.sumelectthermalent: -1367.425246 hartree
zpe.sumelectthermalfe: -1367.506899 hartree
dipole: 3.0359 -5.2068 -3.7503
dipole: 7.0987
quadrupole: -101.6207 -173.1839 -169.4917
quadrupole: 10.2687 4.1826 -5.6308
quadrupole: 46.4781 -25.0851 -21.3929 10.2687 4.1826 -5.6308
hfenergy: -1367.7587529 hartree
pointgroup: C01 [X(C21H14N2O6)]
dipole: -1.2495958 0.6230884 2.4187405 debye
polarizability: 428.2784572|6.6841838|199.9544759|1.8912933|-47.6634662|227.0908175 unknown
InChI: InChI=1S/C21H14N2O6/c1-2-29-21(26)13-9-10-16(17(11-13)23(27)28)22-19(24)14-7-3-5-12-6-4-8-15(18(12)14)20(22)25/h3-11H,2H2,1H3
charge 0 multiplicity 1
43 atoms
O  -0.693677 1.973657 -1.205676
O  -0.575482 -1.811777 1.536013
O  5.732753 0.399112 1.018945
O  1.331871 -0.296722 -3.525066
O  -0.442516 -1.048178 -2.312948
O  5.741859 -0.062038 -1.267745
N  -0.658975 0.098016 0.186363
N  0.730393 -0.519279 -2.408429
C  -3.498476 0.12552 0.347888
C  -2.827543 1.129176 -0.421025
C  -2.762863 -0.894724 1.03123
C  -4.939458 0.140693 0.432353
C  -1.349288 1.12832 -0.535064
C  -1.280447 -0.937569 0.958578
C  0.784427 0.064998 0.070024
C  -3.563826 2.120271 -1.089176
C  -3.438023 -1.876032 1.774421
C  -5.661588 1.167657 -0.258752
C  -5.597683 -0.873454 1.201617
C  1.458594 -0.178228 -1.156339
C  -4.984851 2.139502 -1.005509
C  -4.859034 -1.864088 1.859723
C  1.557736 0.329244 1.219491
C  2.862002 -0.136805 -1.234924
C  3.622082 0.11935 -0.073143
C  2.963476 0.34639 1.160735
C  5.11217 0.136017 -0.200591
C  7.229337 0.437064 0.994089
C  7.687938 0.703215 2.423162
H  -3.019994 2.868253 -1.675047
H  -2.846192 -2.645912 2.280032
H  -6.755999 1.18012 -0.196764
H  -6.692012 -0.864397 1.265718
H  -5.546018 2.917431 -1.532487
H  -5.371359 -2.636272 2.442042
H  1.040692 0.520028 2.163612
H  3.363232 -0.307225 -2.191979
H  3.557138 0.542943 2.056784
H  7.59087 -0.530876 0.602777
H  7.539915 1.230491 0.290667
H  8.791908 0.741332 2.457451
H  7.29717 1.666834 2.792278
H  7.348339 -0.096655 3.103073
