program: Gaussian 09
title: 000293043
version: EM64L-G09RevD.01
frameworkgroup: C1[X(C10H11BrN2O3)]
method: RPBEPBE
basis: SDD
operation: Freq
keyword: #p
keyword: freq=noraman
keyword: PBEPBE/SDD
title: #p freq=noraman PBEPBE/SDD
converged: YES YES NO NO
title: Mulliken charges:
elementType: Br O O O N N C C C C C C C C C C H H H H H H H H H H H
charge: -0.033336 -0.258197 -0.197951 -0.201977 -0.386182 0.027952 -0.349691 -0.411537 0.294113 0.169233 -0.643894 -0.331102 -0.329272 0.389871 -0.354330 -0.366465 0.281198 0.243900 0.327141 0.313044 0.233830 0.256112 0.225211 0.287606 0.232157 0.292326 0.290242
chargesum: 0.00000
title: Mulliken charges with hydrogens summed into heavy atoms:
elementType: Br O O O N N C C C C C C C C C C
charge: -0.033336 -0.258197 -0.197951 -0.201977 -0.073138 0.027952 0.175408 -0.084396 0.294113 0.169233 0.071259 -0.043497 -0.097116 0.389871 -0.062004 -0.076223
polarizability: 2.58566770e+02 6.29714748e+00 1.33301629e+02 -1.87129337e+01 1.21548823e+01 8.49442253e+01
1716.lowfreq: -3.2151 -0.0008 -0.0005 -0.0005 3.8050 11.8223 26.7132 29.2858 35.9360
frequency: 26.6892 28.7700 35.7086 56.0522 67.7852 87.0305 110.4681 169.8060 215.1515 233.4652 240.9638 275.4723 281.9930 289.2008 347.0719 405.3690 408.6607 433.8292 478.9091 489.4026 518.8889 538.7579 614.7196 624.1019 660.2009 681.9189 691.6507 765.3977 767.2357 806.0795 849.0973 876.5831 884.4470 924.9280 985.4924 992.7016 1003.4009 1008.3524 1013.9480 1091.4854 1108.4647 1117.0544 1126.6638 1149.6655 1182.5544 1201.1712 1218.7013 1257.3920 1276.2728 1297.9491 1345.2258 1356.2883 1366.7549 1390.5828 1402.0651 1408.9046 1440.4177 1461.9923 1467.5384 1474.5751 1492.0420 1577.0760 1605.6906 1609.9745 2978.8039 3027.9229 3068.2597 3086.7931 3100.9196 3111.6402 3137.4670 3165.7285 3184.4296 3188.0187 3563.9146
redmass: 9.4097 4.2254 8.5707 5.9056 5.6464 8.3560 9.5650 5.9425 2.7752 2.9107 1.7814 2.7882 5.8322 5.6809 5.1263 2.2065 2.8523 4.5182 5.5040 7.3191 4.0813 1.2947 3.7211 6.8462 5.5142 6.3300 4.1299 4.8485 4.6850 4.7038 1.3410 2.7931 1.6286 1.6672 1.4708 2.0519 2.1601 1.5254 2.0297 3.2165 1.4156 1.8987 2.5196 3.0668 1.3527 1.2493 5.6893 1.6492 1.6048 1.2940 1.3219 1.2193 6.8178 1.2248 11.0549 3.9013 1.1567 1.1334 1.7117 1.0499 2.1360 7.8481 6.8655 7.0505 1.0383 1.0599 1.0954 1.0918 1.1027 1.0991 1.0903 1.0899 1.0945 1.0964 1.0780
irintensity: 0.5040 1.1009 1.1503 5.6996 1.2900 6.2786 3.2526 3.7830 1.3337 2.4503 3.5890 4.1082 0.5006 3.0466 14.6999 1.0158 0.4115 19.1403 2.5518 5.2819 19.6858 92.6061 26.4012 0.4721 7.2533 3.4379 50.9381 5.1245 36.1100 10.2401 10.8665 17.0108 35.2728 16.6385 4.2681 16.9502 3.5270 18.2644 15.2584 21.3781 23.3709 12.5057 16.1371 5.1630 27.1170 46.2488 337.2963 47.8930 66.9667 7.2674 17.8682 4.6465 84.6712 27.6775 0.8470 52.7010 35.7303 43.1426 79.8365 9.1722 197.7345 91.8790 24.5073 18.9109 18.7101 17.1095 19.7737 5.8121 7.3266 15.1796 11.2213 1.2841 1.4176 1.5133 15.5365
temp: 298.150 k
press: 1.00000 atm
elementType: 35 8 8 8 7 7 6 6 6 6 6 6 6 6 6 6 1 1 1 1 1 1 1 1 1 1 1
symmnumber: 1
zpe: 525938.8 jmol-1
zpe.correction: 0.200320 hartree
zpe.thermalcorrener: 0.216113 hartree
zpe.thermalcorrenthalpy: 0.217058 hartree
zpe.thermalcorrgfe: 0.153547 hartree
zpe.sumelectzpe: -735.056755 hartree
zpe.sumelectthermal: -735.040961 hartree
zpe.sumelectthermalent: -735.040017 hartree
zpe.sumelectthermalfe: -735.103528 hartree
dipole: 2.0247 -3.4319 0.4516
dipole: 4.0101
quadrupole: -154.4383 -101.0285 -101.6318
quadrupole: -7.5717 4.6333 4.0035
quadrupole: -35.4055 18.0044 17.4011 -7.5717 4.6333 4.0035
hfenergy: -735.2570747 hartree
pointgroup: C01 [X(C10H11Br1N2O3)]
dipole: -0.8023428 1.3485272 -0.1639257 debye
polarizability: 258.8004558|11.0486882|124.2615951|14.9889904|-22.5331055|93.7505726 unknown
InChI: InChI=1S/C10H11BrN2O3/c1-7(11)6-12-10(14)8-2-4-9(5-3-8)13(15)16/h2-5,7,12H,6H2,1H3
charge 0 multiplicity 1
27 atoms
Br -6.2833 -0.120182 0.083188
O  -1.75212 -1.787836 -0.113586
O  5.100254 -0.593997 0.848781
O  4.944521 1.289597 -0.429014
N  -2.108956 0.445994 -0.637455
N  4.428136 0.26081 0.155113
C  -3.560405 0.260854 -0.820768
C  -4.309844 0.210064 0.532491
C  0.195171 -0.33872 -0.224747
C  -1.28554 -0.624205 -0.320934
C  -4.196946 1.475977 1.383651
C  0.9830 -1.257188 0.516404
C  0.82161 0.765995 -0.860876
C  2.961725 0.048673 0.021013
C  2.370288 -1.0687 0.650153
C  2.210252 0.96745 -0.741898
H  -3.723837 -0.688392 -1.35773
H  -3.950167 1.090339 -1.436586
H  -4.023748 -0.696335 1.088789
H  -1.724915 1.389968 -0.685251
H  -4.558765 2.364163 0.8355
H  -4.782745 1.382318 2.312634
H  -3.138076 1.637913 1.666123
H  0.481701 -2.117455 0.970165
H  0.245171 1.455854 -1.48741
H  2.99535 -1.759641 1.221438
H  2.717585 1.804682 -1.227788
