program: Gaussian 09
title: 000022459
version: EM64L-G09RevD.01
frameworkgroup: C1[X(C3H5N3)]
method: RPBEPBE
basis: SDD
operation: Freq
keyword: #p
keyword: freq=noraman
keyword: PBEPBE/SDD
title: #p freq=noraman PBEPBE/SDD
converged: NO NO NO NO
title: Mulliken charges:
elementType: N N N C C C H H H H H
charge: -0.090113 -0.048514 -0.109448 -0.586150 -0.173330 -0.267736 0.257977 0.257986 0.226488 0.270752 0.262087
chargesum: 0.00000
title: Mulliken charges with hydrogens summed into heavy atoms:
elementType: N N N C C C
charge: -0.090113 -0.048514 -0.109448 0.156301 0.097423 -0.005649
polarizability: 6.14288597e+01 1.64482187e+00 5.25286350e+01 -6.93846843e-04 3.77149456e-04 2.76590820e+01
1716.lowfreq: -17.4669 0.0001 0.0006 0.0007 10.9917 24.5652 93.1143 225.9814 344.7409
frequency: 93.0798 225.9474 344.7398 627.5393 667.5321 673.5852 797.7918 840.0672 916.1165 957.1119 1030.0602 1114.8335 1126.3105 1186.7361 1231.9983 1256.0896 1303.1377 1379.2241 1415.5281 1455.7993 1458.3185 1490.9712 3008.5524 3104.8769 3120.2922 3243.3376 3258.5433
redmass: 1.1046 3.1788 2.8593 3.9870 3.2312 4.8267 1.4677 1.3913 6.6381 4.3645 1.9450 2.3278 1.3287 1.6395 3.3595 3.0142 4.0638 3.6398 2.1538 1.5688 1.0408 1.0801 1.0330 1.1026 1.1020 1.0983 1.1007
irintensity: 0.1115 3.0857 1.7226 4.0118 26.1379 6.3783 30.9396 19.9316 8.2441 16.7480 15.2069 26.1014 1.6935 4.9800 18.7622 7.0263 5.0087 3.6119 13.0377 26.8212 16.9141 15.9928 31.8373 14.9607 10.7046 1.1192 1.7910
temp: 298.150 k
press: 1.00000 atm
elementType: 7 7 7 6 6 6 1 1 1 1 1
symmnumber: 1
zpe: 223271.7 jmol-1
zpe.correction: 0.085040 hartree
zpe.thermalcorrener: 0.090313 hartree
zpe.thermalcorrenthalpy: 0.091257 hartree
zpe.thermalcorrgfe: 0.056231 hartree
zpe.sumelectzpe: -281.092299 hartree
zpe.sumelectthermal: -281.087026 hartree
zpe.sumelectthermalent: -281.086082 hartree
zpe.sumelectthermalfe: -281.121107 hartree
dipole: 3.5494 0.8858 0.0005
dipole: 3.6583
quadrupole: -32.6734 -36.4894 -36.2716
quadrupole: 5.6094 -0.0008 0.0001
quadrupole: 2.4714 -1.3446 -1.1268 5.6094 -0.0008 0.0001
hfenergy: -281.1773386 hartree
pointgroup: C01 [X(C3H5N3)]
dipole: 1.3694865 0.4427535 0.0003263 debye
dipolederiv: -0.5568264 0.0364161 -0.0000714 -0.086221 -0.0351914 0.0001548 0.0002444 -0.0000211 -0.0801467 -0.1754667 0.0963519 -0.0001501 0.291577 -0.3048161 -0.0000093 -0.0000289 0.0000504 -0.1645746 -0.57411 -0.0191448 0.0000623 -0.1015451 -0.3905015 -0.0000367 -0.000095 0.0000888 -0.2379195 0.4717488 -0.0210077 0.0000933 0.0444375 0.1388634 -0.0000267 -0.0000155 -0.0000212 0.205728 0.5269898 -0.081749 0.000111 -0.1693257 0.1003568 -0.0000319 -0.0000184 -0.0002067 -0.0892401 0.14798 0.0778664 0.0000143 0.1038215 0.3565775 -0.000133 0.000123 -0.0000047 -0.0989376 -0.0090954 0.0107476 -0.0255041 0.0567986 0.0795031 0.0883765 -0.0908685 0.071737 -0.0312617 -0.0090202 0.0107957 0.0255001 0.0568873 0.0794282 -0.08842 0.090779 -0.0717874 -0.0310678 0.0468625 0.006141 -0.0000138 -0.0880582 -0.0921094 0.0000735 -0.0000052 0.0000722 0.1314239 0.0854254 -0.0492444 -0.0000368 -0.055924 0.0200857 0.0000073 0.0000204 0.0001405 0.2114463 0.0455121 -0.0671728 -0.0000049 -0.0524477 0.0478038 0.0000454 -0.0001354 -0.0000479 0.1845497 unknown
polarizability: 61.1641427|2.234145|52.7933513|0.0032696|-0.0031312|27.6590827 unknown
InChI: InChI=1S/C3H5N3/c1-6-3-4-2-5-6/h2-3H,1H3
charge 0 multiplicity 1
11 atoms
N  0.698169 0.069403 0.000101
N  0.021211 -1.150682 0.000158
N  -1.47613 0.627538 -0.000426
C  2.161683 0.100454 0.000389
C  -0.210702 1.112939 0.000105
C  -1.284765 -0.751371 0.00031
H  2.551557 -0.408189 0.897284
H  2.55194 -0.408829 -0.895972
H  2.498159 1.149537 0.000082
H  0.071812 2.162461 -0.000074
H  -2.099533 -1.469962 0.000243
