program: Gaussian 09
title: 000293015
version: EM64L-G09RevD.01
frameworkgroup: C1[X(C10H12N2S)]
method: RPBEPBE
basis: SDD
operation: Freq
keyword: #p
keyword: freq=noraman
keyword: PBEPBE/SDD
title: #p freq=noraman PBEPBE/SDD
converged: YES YES NO NO
title: Mulliken charges:
elementType: S N N C C C C C C C C C C H H H H H H H H H H H H
charge: 0.149098 -0.017621 -0.705097 -0.429144 -0.442143 -0.362898 -0.637616 0.550805 -0.569453 -0.412849 0.513778 -0.197661 -0.423339 0.266311 0.238369 0.229968 0.233743 0.242621 0.212094 0.266879 0.239979 0.221280 0.218217 0.309886 0.304791
chargesum: 0.00000
title: Mulliken charges with hydrogens summed into heavy atoms:
elementType: S N N C C C C C C C C C C
charge: 0.149098 -0.017621 -0.090420 -0.162833 0.026195 -0.362898 0.050842 0.550805 -0.302573 -0.172870 0.513778 0.023619 -0.205122
polarizability: 2.12201731e+02 -3.85661768e+00 1.47287588e+02 -4.63039101e+00 2.85933906e-01 7.28415895e+01
1716.lowfreq: -3.8078 -1.8254 -0.0003 0.0018 0.0028 5.7915 32.2774 59.0853 118.1494
frequency: 32.2283 59.0547 118.1442 123.6454 214.8089 236.5551 241.8020 253.9179 319.1493 323.4169 355.4831 370.2632 382.1773 419.8288 434.5765 522.3738 526.8109 552.5932 586.8437 649.9812 653.0492 691.5441 701.2141 794.5373 811.7237 846.5186 875.0613 910.0797 921.8678 946.0595 967.0807 978.1907 986.3644 1009.4852 1047.2648 1078.0997 1099.7554 1107.6423 1180.6285 1181.5958 1205.5984 1221.7960 1292.5671 1305.7047 1311.9974 1331.7818 1391.9070 1400.2559 1447.6895 1457.2335 1465.1204 1472.2011 1486.9898 1587.4347 1604.0633 1623.7574 1642.7111 2975.3756 2977.5461 3045.9077 3059.9619 3073.9068 3098.5683 3118.8189 3139.7810 3143.1728 3160.8259 3568.8382 3709.6929
redmass: 4.7550 3.7382 3.9574 4.4309 3.4397 3.6733 2.1170 1.5787 2.7715 3.5524 1.1930 3.0276 1.0818 3.5392 3.1096 5.0870 6.1171 6.6377 6.5530 5.4506 6.6089 1.7586 3.9141 1.6432 6.2695 2.8530 1.4854 1.5895 1.6151 3.9365 1.3421 4.0026 2.6591 1.4818 1.6548 1.6336 1.8498 1.5416 1.3282 1.2339 1.8843 1.2947 1.4204 1.4017 1.2918 2.4663 1.2084 8.9255 1.1011 3.5708 1.0484 1.0477 2.8372 6.5268 8.1603 3.9954 1.2997 1.0450 1.0560 1.0983 1.0904 1.0945 1.0999 1.0874 1.0908 1.0916 1.0986 1.0449 1.1040
irintensity: 0.6718 1.6835 3.4879 3.3778 5.4634 1.8638 1.9150 0.7586 1.8703 1.8160 250.1381 1.4470 70.4153 5.3380 0.3636 3.6586 1.9347 4.4421 24.1105 0.4494 17.5170 36.2833 0.5400 44.8792 82.1609 3.5122 3.2396 32.7389 6.1769 81.1571 0.8018 4.3156 0.1873 9.1355 1.7653 1.6470 1.1572 20.3061 1.5955 0.4669 40.3536 3.8078 11.4970 4.3719 18.0207 92.8617 20.3201 19.1073 2.9883 74.4822 9.6986 8.2676 49.0888 68.2025 49.5367 53.5104 244.8626 29.9392 46.1983 22.8745 6.3883 37.4719 26.7801 12.3334 24.8618 10.5913 12.6520 67.4134 20.4386
temp: 298.150 k
press: 1.00000 atm
elementType: 16 7 7 6 6 6 6 6 6 6 6 6 6 1 1 1 1 1 1 1 1 1 1 1 1
symmnumber: 1
zpe: 525355.7 jmol-1
zpe.correction: 0.200097 hartree
zpe.thermalcorrener: 0.212532 hartree
zpe.thermalcorrenthalpy: 0.213476 hartree
zpe.thermalcorrgfe: 0.160998 hartree
zpe.sumelectzpe: -894.882638 hartree
zpe.sumelectthermal: -894.870204 hartree
zpe.sumelectthermalent: -894.869260 hartree
zpe.sumelectthermalfe: -894.921738 hartree
dipole: -1.0303 -1.5995 0.4029
dipole: 1.9448
quadrupole: -56.8260 -79.4342 -89.4528
quadrupole: 1.5228 -1.3348 0.9464
quadrupole: 18.4117 -4.1965 -14.2152 1.5228 -1.3348 0.9464
hfenergy: -895.0827353 hartree
pointgroup: C01 [X(C10H12N2S1)]
dipole: 0.3679709 -0.6693765 -0.0443924 debye
dipolederiv: -0.6267735 0.2270448 -0.0966819 0.2231041 -0.4486832 0.0130716 -0.0284675 -0.0009124 -0.1396823 -0.679338 -0.0105729 0.0107037 -0.0207522 -0.9037203 0.1336047 -0.0590958 0.0307427 -0.2822866 -0.7883257 0.644783 -0.1284229 0.838921 -0.8885096 -0.0316743 -0.1554191 -0.0250695 -0.7406796 0.3961206 0.0422139 0.1075441 0.260573 -0.0094418 0.1264486 0.1018302 0.0958254 0.2020338 0.239066 0.0708467 -0.0401242 -0.0014758 0.2523897 -0.012556 0.0361831 -0.009992 0.2092887 1.3186335 -0.2100746 -0.0427395 -0.5111329 0.9235773 -0.149226 -0.0617009 -0.0764789 0.0076675 -0.0586485 0.0120514 -0.0826234 -0.0555234 0.0519037 -0.0409658 -0.0237128 -0.0053697 -0.1053796 -0.2897877 -0.1209287 0.0447122 0.1829172 0.1970526 -0.0441141 0.0160246 -0.0188915 0.0573341 -0.3410952 0.4692764 -0.0851741 -0.1443697 -0.1114617 -0.0102071 0.0377374 -0.0545934 -0.198977 -0.2135659 -0.0861754 0.0171062 0.0036213 -0.2349341 -0.0051794 0.0086731 0.008106 -0.2094331 0.7231011 -0.8319902 0.1179811 -1.0392783 0.8489266 -0.0591893 0.1459488 -0.0613641 0.1547507 0.1980883 0.084673 -0.040585 -0.0119047 0.169336 -0.0501153 -0.0187838 -0.0613356 -0.1038907 -0.0230819 -0.0655229 -0.0080785 0.4192233 -0.2764077 -0.0188522 -0.0926709 0.0119939 -0.2284832 -0.1103624 0.0297123 0.0617422 0.0227837 0.0636637 -0.0406951 0.0592493 -0.0444013 -0.0260688 -0.0665684 -0.0503863 0.026826 0.0615733 0.0932716 0.0052116 0.0654068 0.078468 -0.1517116 -0.0257111 -0.0780324 -0.015456 -0.1070395 -0.054991 -0.0536751 -0.0906742 -0.0906151 0.0654974 0.0909139 0.0381535 -0.0346608 0.0994864 -0.0706313 0.0965959 -0.0458227 0.0376156 0.0463727 -0.0077497 0.0629954 0.1166967 0.0503561 0.056167 -0.05136 0.0662782 -0.0296144 0.0256772 -0.0909272 -0.1159205 -0.0423316 -0.1813647 -0.0031692 -0.0297788 -0.0556625 0.0060243 0.047069 0.1320246 -0.0461454 0.0143828 -0.0112194 -0.0307351 0.0399706 0.0101256 0.0394331 0.154823 0.0287774 0.1020646 -0.0028246 0.1083068 0.031391 0.0287741 -0.0223034 0.0170804 0.1594658 0.0425959 -0.0683716 0.0206861 -0.0929857 -0.0910264 0.0522507 0.0257162 0.0525202 0.1376553 -0.1642024 -0.0197721 0.0281033 0.0087027 0.0827362 0.0161424 0.024015 0.0170692 0.1633735 0.1381233 -0.0358318 0.0270664 -0.0595099 0.1945285 0.0393506 0.0315631 0.0377541 0.3778597 0.178693 -0.04409 0.0261517 -0.0430128 0.1587674 0.0461677 0.0255622 0.0460052 0.3777243 unknown
polarizability: 212.5195185|-0.6227501|145.0368176|-2.9358135|-12.0917831|74.7745722 unknown
InChI: InChI=1S/C10H12N2S/c1-7-6-12-10(13-7)8-3-2-4-9(11)5-8/h2-5,7H,6,11H2,1H3
charge 0 multiplicity 1
25 atoms
S  -2.11327 1.394049 0.197765
N  -1.453327 -1.235852 0.418686
N  3.69965 -1.802497 0.175626
C  -3.536238 0.12262 0.073724
C  -2.914481 -1.190064 0.651104
C  -0.917732 -0.062947 0.228799
C  -4.005527 -0.019205 -1.382889
C  0.530421 0.184607 0.057666
C  1.423153 -0.908087 0.193725
C  1.032078 1.481917 -0.230039
C  2.822929 -0.723908 0.044226
C  2.424451 1.665305 -0.373316
C  3.317737 0.584519 -0.240769
H  -4.346054 0.496263 0.722179
H  -3.083941 -1.251679 1.745576
H  -3.389657 -2.072993 0.185646
H  -4.335415 0.949654 -1.795605
H  -3.188846 -0.402243 -2.02021
H  -4.856206 -0.726436 -1.444086
H  1.004975 -1.89596 0.416751
H  0.346431 2.326992 -0.349243
H  2.820132 2.662878 -0.594485
H  4.396964 0.744807 -0.356311
H  3.349411 -2.734151 0.377001
H  4.701562 -1.67619 0.070475
