program: Gaussian 09
title: 000292998
version: EM64L-G09RevD.01
frameworkgroup: C1[X(C7H5Cl4N)]
method: RPBEPBE
basis: SDD
operation: Freq
keyword: #p
keyword: freq=noraman
keyword: PBEPBE/SDD
title: #p freq=noraman PBEPBE/SDD
converged: YES YES NO NO
title: Mulliken charges:
elementType: Cl Cl Cl Cl N C C C C C C C H H H H H
charge: -0.052400 0.005940 -0.006189 0.034821 -0.686398 0.713877 -0.638290 0.821893 -0.359547 -0.344975 -0.104582 -0.790204 0.253789 0.253857 0.242314 0.328762 0.327331
chargesum: 0.00000
title: Mulliken charges with hydrogens summed into heavy atoms:
elementType: Cl Cl Cl Cl N C C C C C C C
charge: -0.052400 0.005940 -0.006189 0.034821 -0.030305 0.713877 -0.638290 0.821893 -0.359547 -0.344975 -0.104582 -0.040244
polarizability: 1.61508590e+02 -4.13737847e+00 1.57338746e+02 2.80260304e-03 5.45372326e-03 4.91001342e+01
1716.lowfreq: -0.0019 0.0007 0.0020 4.4019 4.4341 8.4391 70.8879 88.3839 98.2714
frequency: 70.8877 88.3799 98.2583 114.8381 177.0613 201.6624 206.0398 212.4318 302.3699 307.8528 316.9091 331.2997 335.2854 346.6920 373.2315 471.7865 486.3736 497.6850 565.4411 603.8530 624.9854 657.2019 700.2669 780.5315 858.9014 1011.6648 1037.4420 1042.6312 1068.4254 1091.4603 1297.1818 1357.1587 1392.8882 1410.6749 1437.7479 1469.1704 1479.1819 1542.4154 1587.4815 1629.6413 2999.9581 3076.8187 3128.7029 3546.0382 3691.5166
redmass: 21.4945 3.5854 1.4043 3.5878 4.9304 28.9288 33.4765 20.8842 6.1194 5.8855 5.8704 8.1523 4.7082 15.3171 7.8431 1.0585 1.2070 6.5892 6.8438 4.1264 8.4910 5.9784 10.2975 8.7969 10.0110 1.7715 3.8719 1.4985 6.4267 1.7453 8.5850 6.9638 2.4949 1.7047 2.9434 1.0436 1.4464 8.3423 2.5176 1.7762 1.0384 1.0974 1.0980 1.0447 1.1045
irintensity: 0.2403 0.0627 0.1822 1.3206 7.1503 0.1058 0.1482 0.2687 2.4816 2.3894 0.2443 2.9508 5.2211 0.6915 2.2803 16.2900 271.0792 10.1627 0.0573 3.2382 2.8374 33.2214 55.5101 13.1497 3.4568 37.3600 57.1245 6.8803 3.7563 35.0362 41.5884 38.5158 26.9802 0.9510 77.6973 16.0312 88.9480 7.1552 1.5807 298.5927 10.0279 9.3998 6.7029 96.6980 51.3717
temp: 298.150 k
press: 1.00000 atm
elementType: 17 17 17 17 7 6 6 6 6 6 6 6 1 1 1 1 1
symmnumber: 1
zpe: 275311.1 jmol-1
zpe.correction: 0.104860 hartree
zpe.thermalcorrener: 0.117420 hartree
zpe.thermalcorrenthalpy: 0.118364 hartree
zpe.thermalcorrgfe: 0.065166 hartree
zpe.sumelectzpe: -2163.863758 hartree
zpe.sumelectthermal: -2163.851198 hartree
zpe.sumelectthermalent: -2163.850254 hartree
zpe.sumelectthermalfe: -2163.903452 hartree
dipole: 2.7675 -1.3342 -0.0013
dipole: 3.0724
quadrupole: -97.7916 -87.3284 -99.4314
quadrupole: -2.4503 -0.0035 0.0122
quadrupole: -2.9411 7.5220 -4.5809 -2.4503 -0.0035 0.0122
hfenergy: -2163.9686186 hartree
pointgroup: C01 [X(C7H5Cl4N1)]
dipole: -0.9864711 -0.697885 -0.0305279 debye
dipolederiv: -0.7482262 -0.1063571 -0.0174149 -0.1413 -0.1738862 -0.0047014 -0.0178966 -0.0039015 -0.0482287 -0.1461918 -0.1998814 -0.0053113 -0.198516 -0.6470853 -0.0120096 -0.0053099 -0.0121138 -0.021106 -0.3097426 0.2805698 -0.0034531 0.3115726 -0.4895936 0.0016786 -0.0030118 0.0009085 -0.0177459 -0.6476718 -0.0964871 -0.0160857 -0.0855159 -0.0286751 -0.0022727 -0.0159186 -0.0025314 -0.0037396 -0.3637079 -0.4413746 0.0019459 -0.4508139 -1.3577925 -0.0187707 0.0016279 -0.0192335 -0.6740968 0.072074 -0.2785923 -0.0041476 0.0114912 0.0872091 -0.0002376 -0.0005105 -0.0074335 0.1164287 1.0151441 0.3502476 0.0317477 -0.0644178 -0.2003937 -0.0017928 0.0270848 0.0079767 -0.1808447 -0.1162137 0.6065733 -0.0005711 0.5522442 1.1507113 0.0238302 -0.0014662 0.0249787 0.2206808 -0.2851934 0.4508338 0.0025872 0.2670468 0.6628243 0.0159347 0.0004903 0.0204577 -0.1650197 0.1595385 -0.8973498 -0.0037846 -0.3226197 0.3351263 -0.0018087 0.0029803 -0.0151116 -0.1368326 0.8984006 0.1939741 0.0224574 -0.0246135 0.1007889 0.0001901 0.0197811 0.0052584 0.0315352 -0.0015315 0.0508465 -0.0005098 0.1089909 -0.1480834 0.0004345 -0.0002441 -0.0004424 0.0420989 0.0782771 0.0095939 -0.0566247 0.0291246 0.026039 -0.0765939 -0.0104307 -0.0914909 -0.0184299 0.0748883 0.0048481 0.0605816 0.025676 0.0225333 0.0785691 0.0150255 0.0925969 -0.0122718 -0.0738127 0.0042875 -0.0039366 -0.0892263 0.1031004 -0.0019345 -0.0050196 -0.0000222 0.1164827 0.2100158 0.0563447 -0.0031088 0.0326874 0.2696728 -0.0004564 -0.0031978 0.0003874 0.3761854 0.1839532 0.011923 -0.0043715 0.0381893 0.2875044 -0.000059 -0.003984 -0.0002836 0.3749039 unknown
polarizability: 159.9809455|4.5601555|158.7891386|2.6303196|1.3836021|49.177386 unknown
InChI: InChI=1S/C7H5Cl4N/c1-2-3(8)5(10)6(11)7(12)4(2)9/h12H2,1H3
charge 0 multiplicity 1
17 atoms
Cl -3.186286 -0.603749 -0.070958
Cl 1.097735 3.001515 0.070648
Cl 2.001477 -2.525498 0.026389
Cl 3.145812 0.503532 0.088757
N  -1.010483 -2.666402 -0.044862
C  -0.943191 1.099806 0.000608
C  -1.389116 -0.237655 -0.025093
C  -0.52595 -1.374121 -0.018419
C  0.464253 1.300349 0.035789
C  0.872531 -1.101519 0.017174
C  1.367785 0.215389 0.044171
C  -1.884728 2.284763 -0.00809
H  -1.726778 2.910548 0.888219
H  -1.689099 2.927403 -0.884891
H  -2.936459 1.966242 -0.033604
H  -2.013539 -2.830705 -0.069345
H  -0.363263 -3.450598 -0.038192
