program: Gaussian 09
title: 000293009
version: EM64L-G09RevD.01
frameworkgroup: C1[X(C21H35NO)]
method: RPBEPBE
basis: SDD
operation: Freq
keyword: #p
keyword: freq=noraman
keyword: PBEPBE/SDD
title: #p freq=noraman PBEPBE/SDD
converged: NO YES NO NO
title: Mulliken charges:
elementType: O N C C C C C C C C C C C C C C C C C C C C C H H H H H H H H H H H H H H H H H H H H H H H H H H H H H H H H H H H
charge: -0.251016 -0.460622 -0.386658 -0.385557 -0.385824 -0.385120 -0.385432 -0.381705 -0.385627 -0.373043 -0.370054 -0.353125 -0.365077 -0.356768 -0.573266 -0.696731 0.206050 0.480533 -0.448059 -0.347971 -0.198317 -0.214807 -0.254949 0.192702 0.193695 0.194173 0.193235 0.195404 0.193591 0.192916 0.192456 0.193673 0.191636 0.191728 0.192099 0.194560 0.198799 0.189106 0.189165 0.187780 0.188683 0.187619 0.187591 0.206203 0.237355 0.194575 0.194623 0.214877 0.241588 0.209620 0.214770 0.209696 0.302667 0.217767 0.308321 0.225582 0.226559 0.228331
chargesum: 0.00000
title: Mulliken charges with hydrogens summed into heavy atoms:
elementType: O N C C C C C C C C C C C C C C C C C C C C C
charge: -0.251016 -0.157955 -0.000262 0.001851 0.003170 0.000252 -0.000123 0.002122 0.007733 0.005228 0.006409 0.022085 0.078481 0.032431 -0.116801 -0.062645 0.206050 0.480533 -0.230292 -0.039650 0.027265 0.011752 -0.026618
polarizability: 3.60601499e+02 -6.44750933e-01 2.14895403e+02 -1.30838102e+01 3.96917012e+00 1.59279493e+02
1716.lowfreq: -50.7943 -8.4858 -2.5738 -0.0024 0.0012 0.0022 3.5171 9.2387 15.1438
frequency: -43.2709 -6.0058 13.1937 15.3517 25.4038 35.3598 39.8746 63.6605 64.2664 72.9565 78.6756 92.6639 98.1576 106.7684 115.7418 125.0134 130.2174 139.0918 146.6335 152.9560 181.8985 226.8501 231.8198 238.3224 258.4684 301.8972 332.0050 347.8831 368.5467 408.3085 431.8174 439.7643 493.9185 498.7490 505.7984 550.9065 605.9868 614.8238 639.8625 697.6035 715.9500 717.0090 717.6144 720.9148 726.7055 737.8669 757.5256 769.1626 787.5096 818.3136 830.3554 843.6785 867.6990 887.3275 911.9795 917.9021 927.5450 956.5713 972.3841 975.7526 984.4165 985.9074 997.8441 1001.7048 1004.3807 1023.3814 1027.3306 1030.9499 1039.5542 1055.7551 1069.1800 1078.4335 1080.8545 1081.5206 1082.2600 1088.6837 1091.6346 1100.3576 1123.3264 1167.8617 1172.0014 1179.7780 1187.8302 1195.8505 1197.5220 1216.9269 1222.9042 1238.7753 1245.5384 1256.2132 1260.6557 1267.1496 1275.9947 1276.9355 1281.8818 1286.0514 1289.2505 1289.8730 1294.6798 1296.2294 1299.1610 1310.5414 1319.2673 1331.6996 1345.0783 1350.7770 1353.2253 1354.6622 1358.2197 1362.3258 1384.3874 1387.0749 1425.2893 1440.1481 1456.3692 1456.4112 1459.3669 1459.8161 1462.3062 1463.7889 1466.4476 1470.7198 1475.3696 1477.1460 1479.8633 1483.6412 1485.0920 1486.7110 1487.8665 1506.6320 1599.2109 1614.3903 1626.7969 2946.8985 2947.0472 2947.5722 2948.6840 2949.3706 2950.2337 2952.4402 2955.4499 2956.2293 2960.1751 2963.6430 2966.0950 2970.5498 2979.3257 2981.4644 2984.0950 2986.8102 2990.1489 2994.3201 3000.8161 3007.4186 3010.1081 3019.5654 3028.4595 3036.1521 3041.7321 3062.6122 3066.8745 3069.5170 3109.2189 3131.6015 3144.0312 3164.5387 3195.3980 3522.7374
redmass: 1.7464 4.3462 3.5674 4.4639 1.7914 3.8358 4.1230 2.8880 2.4452 2.8168 4.4820 2.0314 2.9545 3.3703 2.6371 2.0936 3.1131 2.1579 2.1897 2.0649 3.9446 4.3447 1.1090 3.8899 3.7451 3.7182 5.1468 4.9154 3.3380 2.9210 3.4815 3.1660 3.0362 3.0768 2.8288 3.5473 4.1573 6.2901 1.1799 1.9758 1.0603 3.9552 1.0753 1.0828 1.1206 1.1503 1.1897 1.7023 1.2517 2.0571 1.8780 1.2714 1.2937 1.9058 1.2682 1.4593 6.1934 1.2318 1.3499 5.3830 5.9872 4.7681 1.1993 1.3066 3.9726 3.3667 2.3742 1.0803 3.3612 3.2192 2.7984 2.1082 2.3308 2.3649 2.1157 1.5944 2.7274 1.4066 3.0027 2.2211 1.0565 1.9260 1.1152 1.6674 1.3093 1.4908 1.3390 1.3827 1.3417 1.7208 1.4497 1.3058 1.1178 1.1133 1.0394 1.1542 1.1840 1.1242 1.1206 1.1218 1.1535 1.3760 1.4316 1.4255 1.4869 1.7105 1.6134 1.6461 1.6160 1.6588 5.8125 1.2167 2.3232 1.1007 1.0742 1.0739 1.0727 1.0677 1.0708 1.0713 1.0817 1.0866 1.0873 1.0448 1.0908 1.0995 2.2756 1.0880 1.1013 2.1445 6.2555 5.6335 4.8727 1.0584 1.0584 1.0587 1.0587 1.0591 1.0592 1.0594 1.0593 1.0592 1.0589 1.0585 1.0584 1.0364 1.0960 1.0963 1.0945 1.0876 1.0860 1.0952 1.1015 1.0961 1.1041 1.1048 1.1050 1.1048 1.1045 1.1019 1.1007 1.0993 1.0884 1.0868 1.0934 1.0999 1.0951 1.0762
irintensity: 0.6292 0.1194 0.0333 0.3554 0.1217 0.0401 0.2203 0.4388 1.9673 1.5297 1.1688 0.3196 0.4676 0.1277 0.4656 0.0456 0.4873 0.7564 0.3794 0.3405 3.3932 0.1644 0.0548 5.9304 1.0158 2.4013 0.2096 5.0286 0.9160 0.0179 2.0431 1.7780 1.5602 0.8405 21.8786 6.3152 0.5318 0.8161 38.1952 50.8724 18.3253 2.2255 1.1682 9.9518 0.4059 2.9863 0.5845 91.8776 4.0334 0.9158 0.8746 0.1571 1.8600 5.0396 0.0685 14.1107 12.8326 0.9638 0.1453 0.1236 0.7269 1.4152 0.3496 3.1625 1.2452 0.6178 4.2484 0.4294 1.9191 0.1249 2.0852 1.9977 0.4881 2.0841 2.9703 19.0766 5.4157 6.3303 9.6396 47.1067 1.1112 1.8508 2.4942 0.8213 50.5948 0.4193 7.0740 0.1875 5.1150 26.9249 9.9963 7.6573 0.4648 0.3876 0.1744 0.7193 0.8223 0.6629 0.4623 0.0404 1.6277 11.6933 50.3859 9.6875 4.5727 0.3806 0.4656 0.5527 0.7914 1.4135 88.7049 11.0938 118.2777 9.7921 0.0023 0.0179 0.0165 0.0711 0.1032 0.1020 1.2233 0.8550 2.2690 12.0982 1.2823 4.0422 53.7445 9.2141 43.4454 370.7117 56.2631 58.1589 89.8266 0.4120 0.1210 1.8333 0.8478 2.1516 2.0509 0.9068 15.2953 4.6195 6.2249 145.7372 235.7637 38.3545 0.0875 0.5411 4.1679 13.3645 14.6776 6.4910 1.6248 16.2510 0.7470 0.0839 12.6712 0.5534 332.6364 74.8886 98.7341 56.0710 15.6760 0.5850 32.0428 26.1445 8.0525 10.1748
temp: 298.150 k
press: 1.00000 atm
elementType: 8 7 6 6 6 6 6 6 6 6 6 6 6 6 6 6 6 6 6 6 6 6 6 1 1 1 1 1 1 1 1 1 1 1 1 1 1 1 1 1 1 1 1 1 1 1 1 1 1 1 1 1 1 1 1 1 1 1
symmnumber: 1
zpe: 1351059.4 jmol-1
zpe.correction: 0.514591 hartree
zpe.thermalcorrener: 0.540240 hartree
zpe.thermalcorrenthalpy: 0.541184 hartree
zpe.thermalcorrgfe: 0.454036 hartree
zpe.sumelectzpe: -949.417906 hartree
zpe.sumelectthermal: -949.392258 hartree
zpe.sumelectthermalent: -949.391313 hartree
zpe.sumelectthermalfe: -949.478461 hartree
dipole: -0.2710 -3.5183 -0.5241
dipole: 3.5674
quadrupole: -140.8202 -141.2261 -146.0652
quadrupole: -18.4621 -4.8568 0.2588
quadrupole: 1.8836 1.4777 -3.3614 -18.4621 -4.8568 0.2588
hfenergy: -949.9324978 hartree
pointgroup: C01 [X(C21H35N1O1)]
dipole: -0.1070336 -1.3382838 -0.4091475 debye
polarizability: 360.5119692|1.4481698|212.5045779|-13.6945267|11.9487626|161.7598484 unknown
InChI: InChI=1S/C21H35NO/c1-2-3-4-5-6-7-8-9-10-11-12-16-19-21(23)22-20-17-14-13-15-18-20/h13-15,17-18,22H,2-12,16,19H2,1H3
charge 0 multiplicity 1
58 atoms
O  4.889662 1.30132 0.71123
N  5.964171 -0.623558 -0.097647
C  -4.17942 -0.552629 0.136781
C  -5.444104 0.330595 0.045004
C  -2.864216 0.258246 0.112077
C  -6.760171 -0.479303 0.047914
C  -1.5983 -0.621368 0.220752
C  -8.02385 0.40632 -0.034265
C  -0.284639 0.189608 0.1561
C  -9.340762 -0.402434 -0.041171
C  0.983098 -0.683133 0.297096
C  -10.603893 0.484551 -0.117072
C  2.288621 0.131553 0.17122
C  -11.921474 -0.323994 -0.124663
C  3.550446 -0.736611 0.350631
C  -13.177289 0.571211 -0.197476
C  4.844194 0.092226 0.336885
C  7.324922 -0.203731 -0.17902
C  8.283742 -1.174934 -0.577665
C  7.743682 1.124225 0.105059
C  9.644598 -0.826032 -0.693071
C  9.110414 1.45636 -0.015888
C  10.067703 0.49432 -0.412995
H  -4.177726 -1.276944 -0.704746
H  -4.220966 -1.157655 1.066953
H  -5.45262 1.04736 0.89289
H  -5.395315 0.944253 -0.87909
H  -2.871008 0.994309 0.943161
H  -2.818532 0.850386 -0.826053
H  -6.806733 -1.100765 0.966955
H  -6.754657 -1.188702 -0.806211
H  -1.630964 -1.195432 1.170695
H  -1.604497 -1.372698 -0.596798
H  -7.97398 1.031141 -0.950799
H  -8.032309 1.112803 0.822234
H  -0.243964 0.741768 -0.806093
H  -0.287458 0.959579 0.955364
H  -9.334465 -1.104495 -0.901381
H  -9.389057 -1.031841 0.872387
H  0.963528 -1.480259 -0.476113
H  0.962167 -1.200878 1.279584
H  -10.611758 1.186888 0.742886
H  -10.556799 1.113989 -1.030649
H  2.32292 0.629529 -0.818178
H  2.310925 0.941983 0.922869
H  -11.966279 -0.954169 0.7873
H  -11.913749 -1.024006 -0.985233
H  3.587812 -1.527127 -0.42695
H  3.494665 -1.2601 1.329095
H  -13.17111 1.187911 -1.116281
H  -14.105692 -0.029353 -0.19993
H  -13.222524 1.260411 0.667014
H  5.791122 -1.591071 -0.381485
H  7.964252 -2.202884 -0.794828
H  7.001532 1.863867 0.410052
H  10.372618 -1.585071 -1.00029
H  9.427745 2.482389 0.201865
H  11.124439 0.767478 -0.502912
