program: Gaussian 09
title: 000292978
version: EM64L-G09RevD.01
frameworkgroup: C1[X(C8H9N3O4)]
method: RPBEPBE
basis: SDD
operation: Freq
keyword: #pfreq=noraman
keyword: PBEPBE/SDD
title: #p freq=noraman PBEPBE/SDD
converged: NO YES NO NO
title: Mulliken charges:
elementType: O O O O N N N C C C C C C C C H H H H H H H H H
charge: -0.181270 -0.168915 -0.206061 -0.191207 -0.028681 0.003647 -0.706615 0.195107 0.147351 0.174181 0.316307 0.478583 -0.689801 -0.755657 -0.819814 0.280241 0.244827 0.228655 0.270450 0.230386 0.269232 0.246310 0.337016 0.325729
chargesum: 0.00000
title: Mulliken charges with hydrogens summed into heavy atoms:
elementType: O O O O N N N C C C C C C C C
charge: -0.181270 -0.168915 -0.206061 -0.191207 -0.028681 0.003647 -0.043870 0.195107 0.147351 0.174181 0.316307 0.478583 -0.409560 -0.011725 -0.073886
polarizability: 1.70046676e+02 -5.01965986e+00 1.61133415e+02 -1.95538440e+00 5.82749800e+00 7.06630306e+01
1716.lowfreq: -3.2059 -0.0005 -0.0004 0.0006 8.6670 9.2986 39.1359 54.3236 82.6777
frequency: 39.1169 54.3045 82.6749 94.9143 141.2039 163.7767 173.9008 186.0187 227.7445 234.5970 310.0208 331.6913 338.6999 347.5818 377.1083 393.9438 399.9613 432.0536 447.6972 478.0340 516.5896 595.3404 619.9055 643.3619 691.3260 710.0773 721.7050 734.0674 744.8642 836.7686 890.9280 903.6653 1008.2141 1036.1001 1038.4877 1045.6495 1050.9103 1066.6330 1203.4632 1209.3677 1219.9654 1246.4764 1315.7853 1357.3588 1370.3039 1378.9766 1407.5481 1412.6342 1424.2091 1459.1906 1473.2889 1480.0278 1486.7892 1500.7766 1565.1288 1629.0262 1652.9181 2969.2598 3011.6006 3037.1299 3094.5101 3119.2283 3130.9806 3168.9099 3571.7713 3709.6874
redmass: 10.4236 9.0058 4.6739 3.6760 1.7809 2.5535 1.2948 3.2646 4.4730 4.1935 7.1059 3.2768 4.7165 2.9751 2.3776 2.0848 2.1712 5.4445 1.2469 5.7538 5.3357 6.6900 4.6179 4.8294 5.7473 7.5531 7.5016 12.7792 4.3776 5.6731 3.3057 1.6538 2.3299 1.5093 1.5260 1.5677 2.4037 1.7361 6.9166 2.4173 3.6257 9.9801 4.9290 5.5855 7.9131 5.1602 1.3145 1.2250 3.1641 1.0966 1.0631 1.1264 1.3062 4.4070 7.2185 3.7505 1.3550 1.0418 1.0377 1.0976 1.0963 1.1006 1.0937 1.0916 1.0457 1.1035
irintensity: 0.5253 2.6167 1.6214 0.5367 3.2967 3.0550 1.9307 3.5902 0.6605 1.1811 2.2959 0.9067 1.8181 3.8416 4.6474 31.8674 65.2240 2.0822 188.9013 0.9972 0.0417 3.1680 3.4945 4.6223 7.8951 23.7654 5.6148 16.0807 0.8012 18.3459 2.2309 33.8522 5.6193 1.8733 1.2437 14.0192 3.8521 10.4331 204.0332 145.2384 7.3401 65.3164 62.6088 38.5546 163.8303 50.8208 2.9263 27.7871 41.0976 14.4783 24.5136 16.6283 3.4359 147.3224 14.7408 20.0237 249.4881 16.5465 6.2977 12.5547 6.3169 12.7559 3.8961 5.5120 90.8424 29.8406
temp: 298.150 k
press: 1.00000 atm
elementType: 8 8 8 8 7 7 7 6 6 6 6 6 6 6 6 1 1 1 1 1 1 1 1 1
symmnumber: 1
zpe: 452882.0 jmol-1
zpe.correction: 0.172494 hartree
zpe.thermalcorrener: 0.186992 hartree
zpe.thermalcorrenthalpy: 0.187937 hartree
zpe.thermalcorrgfe: 0.130867 hartree
zpe.sumelectzpe: -774.134585 hartree
zpe.sumelectthermal: -774.120086 hartree
zpe.sumelectthermalent: -774.119142 hartree
zpe.sumelectthermalfe: -774.176211 hartree
dipole: -2.6129 6.0117 -0.1948
dipole: 6.5579
quadrupole: -107.0766 -71.7209 -90.4047
quadrupole: -9.2877 1.3946 -3.4542
quadrupole: -17.3425 18.0131 -0.6706 -9.2877 1.3946 -3.4542
hfenergy: -774.3070783 hartree
pointgroup: C01 [X(C8H9N3O4)]
dipole: -1.0232003 -2.367043 0.0836623 debye
dipolederiv: -0.6243504 0.0971213 -0.2742857 0.1550872 -0.3555729 -0.0382393 -0.1717745 -0.1410818 -0.5457475 -0.3930041 0.1815145 0.0063946 0.1480436 -0.5225295 -0.2683039 -0.1183753 -0.1685542 -0.5448109 -0.8409673 0.1769835 0.1078742 0.2284503 -0.5530538 -0.1260347 0.0968043 -0.1226904 -0.2733746 -0.6182741 -0.1868186 -0.0216874 -0.2476164 -0.6803328 -0.1370489 0.0010886 -0.130465 -0.2465831 0.8825456 -0.4236098 0.313591 -0.4713403 0.6907971 0.3612071 0.3021658 0.3604099 0.9221464 1.8082071 0.0938625 -0.1248982 0.1288931 0.9977701 0.3137064 -0.1057428 0.2860762 0.2653006 -0.1428326 -0.2575224 0.0055172 -0.2895403 -1.494633 0.0433479 0.0106224 0.0589594 -0.705359 0.0112279 0.1231958 -0.0131957 -0.0704323 0.0652965 -0.0188518 0.0425298 -0.0879437 -0.025346 0.3688688 0.3926515 -0.0353942 -0.202053 -0.1898124 0.0075859 -0.0767032 0.0494028 -0.0505307 0.0241177 -0.0018588 -0.03688 0.170352 0.0248987 -0.0434051 0.0078957 -0.0221437 -0.0313119 -0.6166786 -0.0682544 0.0417409 -0.3166397 0.1394605 -0.0399289 -0.0057973 -0.0081031 0.06123 -0.4336043 0.3211641 0.0065268 0.4485934 1.5941841 -0.067033 0.004284 -0.0456841 0.138934 0.0829176 -0.3879958 -0.0045043 0.3645978 -0.295833 -0.0046303 0.0312176 0.0250173 -0.1812161 0.1163613 -0.1260749 0.0178459 -0.0019081 -0.1515727 -0.0053065 0.0035609 -0.0315585 0.0747407 -0.1261455 -0.0890842 0.0062464 -0.1255398 -0.0325762 -0.0002054 0.0104489 -0.0160135 0.0983624 0.0970972 0.0615937 0.0009731 0.0282259 0.0448229 0.009582 -0.0151935 -0.0139612 0.1746168 -0.0197845 -0.0262585 0.0914131 0.0131524 0.0675524 0.0005591 0.0744978 0.0311909 0.0250141 -0.0356911 0.1213671 -0.0684703 0.0364707 0.0350656 0.0231673 -0.0538657 0.0377515 0.0697787 0.0907807 -0.0204974 -0.0328896 -0.0164653 0.0347191 -0.0196205 -0.045559 -0.0421882 -0.015239 0.0358315 -0.0054093 -0.0176427 -0.0563884 0.0067375 0.1080833 0.0420051 0.1016423 -0.0226735 0.031292 0.0410268 0.0205684 0.1283762 0.0362687 -0.0209787 0.0022595 -0.0226707 0.0999139 0.0312713 -0.0336606 0.005276 -0.0622813 0.0365121 -0.0868851 -0.040821 -0.0891943 -0.0233169 0.1558205 0.0441961 -0.0024885 0.0154908 0.2416239 0.0063903 -0.0146008 -0.0044933 0.3569457 0.1149934 -0.0276323 0.008369 -0.0055286 0.2602072 0.0028431 0.0190528 -0.0037046 0.3785261 unknown
polarizability: 170.0720468|5.1516967|161.073585|-0.0893147|6.2706447|70.6974898 unknown
InChI: InChI=1S/C8H9N3O4/c1-4-6(9)3-7(10(12)13)5(2)8(4)11(14)15/h3H,9H2,1-2H3
charge 0 multiplicity 1
24 atoms
O  -2.945604 1.28088 -0.96667
O  -2.148815 2.176989 0.973442
O  3.644109 -0.681117 -0.451678
O  3.163339 1.431876 0.242128
N  -2.09165 1.334786 0.000076
N  2.805681 0.239492 -0.099927
N  -0.508778 -3.327156 0.093091
C  0.349999 0.88491 -0.066703
C  -1.320216 -1.014114 0.049211
C  -0.96982 0.355071 -0.006329
C  1.362261 -0.116813 -0.064832
C  -0.244737 -1.963316 0.036105
C  1.088508 -1.497424 -0.027034
C  0.614518 2.373533 -0.191568
C  -2.741794 -1.524679 0.152389
H  1.93133 -2.194012 -0.04831
H  1.432614 2.571642 -0.9016
H  -0.282132 2.917858 -0.525049
H  0.930699 2.800464 0.77562
H  -2.851246 -2.182883 1.036808
H  -3.486636 -0.722155 0.236662
H  -3.011478 -2.114886 -0.745818
H  -1.458878 -3.683531 0.10667
H  0.254024 -3.998417 0.091115
