program: Gaussian 09
title: 000292999
version: EM64L-G09RevD.01
frameworkgroup: C1[X(C14H6Cl8)]
method: RPBEPBE
basis: SDD
operation: Freq
keyword: #pfreq=noraman
keyword: PBEPBE/SDD
title: #p freq=noraman PBEPBE/SDD
converged: YES YES NO NO
title: Mulliken charges:
elementType: Cl Cl Cl Cl Cl Cl Cl Cl C C C C C C C C C C C C C C H H H H H H
charge: -0.003678 -0.003681 0.039856 0.039868 0.029711 0.029716 0.051263 0.051269 0.547349 0.547318 -0.577720 -0.577726 0.671605 0.671578 -0.300254 -0.300190 -0.324038 -0.324099 -0.103160 -0.103104 -0.788610 -0.788623 0.255287 0.256031 0.246359 0.256034 0.246363 0.255277
chargesum: 0.00000
title: Mulliken charges with hydrogens summed into heavy atoms:
elementType: Cl Cl Cl Cl Cl Cl Cl Cl C C C C C C C C C C C C C C
charge: -0.003678 -0.003681 0.039856 0.039868 0.029711 0.029716 0.051263 0.051269 0.547349 0.547318 -0.577720 -0.577726 0.671605 0.671578 -0.300254 -0.300190 -0.324038 -0.324099 -0.103160 -0.103104 -0.030934 -0.030949
polarizability: 3.23681186e+02 -9.54150260e-03 1.91224576e+02 -3.47080898e+00 -1.33847274e-04 1.91772330e+02
1716.lowfreq: -3.3299 -1.7170 0.0022 0.0023 0.0024 1.8738 22.1468 29.8296 30.3028
frequency: 22.1458 29.8283 30.3018 66.3107 68.5788 85.8967 86.6295 90.9647 91.3886 113.9551 114.2451 132.0437 197.7536 198.0132 203.2091 206.4232 209.9587 210.0211 212.6015 236.4659 306.6177 307.9471 317.2693 317.3285 332.6672 340.0731 349.3183 349.4062 369.0167 370.8275 396.7224 432.2441 549.4151 560.3284 564.1356 599.6142 600.8932 620.8782 647.6580 661.1331 698.9530 701.8787 762.8705 785.8082 786.0188 848.9554 886.7999 985.2528 1020.3803 1023.5568 1042.9337 1042.9726 1061.0956 1081.5400 1207.5181 1278.5640 1322.2413 1332.7354 1332.7967 1359.7923 1362.9282 1404.7537 1406.3532 1409.6800 1462.3295 1470.0499 1470.1490 1470.5223 1531.2934 1535.7149 1565.0799 1579.5536 2998.5138 2998.5744 3074.5022 3074.5874 3131.1075 3131.1386
redmass: 13.4693 18.3382 18.9225 24.5957 28.5812 7.6636 8.3275 1.8606 1.8840 1.8013 1.7602 19.4120 7.5316 7.2982 27.9232 26.9981 28.4710 27.2346 22.2062 24.2159 6.5430 6.3712 5.8913 5.7341 7.0595 7.0051 29.4886 30.2447 9.8353 10.5815 8.6455 7.0112 12.1012 7.7351 6.1391 7.3530 7.4078 6.5984 7.3849 10.1367 9.1502 9.5113 11.1430 8.8724 8.8624 11.6475 8.9740 7.0353 1.4919 1.5409 1.4972 1.4973 9.9689 10.4751 10.5864 9.7747 7.6253 10.0432 10.0355 8.8187 10.5692 1.6944 1.1968 2.3255 1.1426 1.0434 1.0568 1.2041 9.0341 11.0506 8.4187 9.3262 1.0390 1.0390 1.0973 1.0973 1.0975 1.0975
irintensity: 0.1326 0.1096 0.0707 0.0494 0.0230 0.3268 0.3570 0.0020 0.0037 1.2409 1.2424 0.0095 0.4770 0.5122 0.1230 0.0204 0.0863 0.3192 0.2835 0.0989 3.4679 0.6754 2.2028 0.0413 0.1210 0.1489 0.0912 0.0500 2.1319 1.5175 9.5091 5.8424 48.2357 0.0475 12.4156 0.0057 0.0565 16.2738 7.7517 1.5242 39.5709 30.2355 41.4452 2.1342 2.1695 0.9709 12.0672 4.3107 104.2979 7.1030 3.9638 3.7249 19.6026 9.1724 20.9067 48.6518 163.0843 2.2737 3.8859 74.4041 124.9043 0.0498 15.7217 5.2765 24.8574 14.6997 6.8096 23.8664 7.3497 3.5307 40.2182 0.1340 10.1403 6.9787 7.1689 7.2341 4.6464 4.5868
temp: 298.150 k
press: 1.00000 atm
elementType: 17 17 17 17 17 17 17 17 6 6 6 6 6 6 6 6 6 6 6 6 6 6 1 1 1 1 1 1
symmnumber: 1
zpe: 408164.2 jmol-1
zpe.correction: 0.155462 hartree
zpe.thermalcorrener: 0.178649 hartree
zpe.thermalcorrenthalpy: 0.179593 hartree
zpe.thermalcorrgfe: 0.099901 hartree
zpe.sumelectzpe: -4215.998539 hartree
zpe.sumelectthermal: -4215.975351 hartree
zpe.sumelectthermalent: -4215.974407 hartree
zpe.sumelectthermalfe: -4216.054099 hartree
dipole: 0.0000 2.3626 -0.0009
dipole: 2.3626
quadrupole: -178.9551 -179.8282 -178.8402
quadrupole: -0.0037 -10.8489 -0.0008
quadrupole: 0.2527 -0.6204 0.3676 -0.0037 -10.8489 -0.0008
hfenergy: -4216.1540001 hartree
pointgroup: C01 [X(C14H6Cl8)]
dipole: 0.0071114 -0.9293338 -0.0175621 debye
polarizability: 323.6072154|1.0887145|191.233671|-4.540558|-0.0454115|191.8372055 unknown
InChI: InChI=1S/C14H6Cl8/c1-3-7(15)5(11(19)13(21)9(3)17)6-8(16)4(2)10(18)14(22)12(6)20/h1-2H3
charge 0 multiplicity 1
28 atoms
Cl 0.531566 -1.996102 1.929939
Cl -0.507888 -1.928355 -1.993836
Cl 0.563801 1.983944 -1.911355
Cl -0.600641 1.899997 1.997727
Cl 5.382077 0.027872 0.082232
Cl -5.388591 -0.050196 -0.072791
Cl 3.788425 2.019208 -1.875789
Cl -3.825156 1.887129 1.962393
C  0.744368 -0.009236 0.015242
C  -0.750891 -0.0205 -0.003895
C  1.483633 -0.869077 0.863034
C  -1.477037 -0.858877 -0.883911
C  2.898664 -0.89555 0.920653
C  -2.89149 -0.905216 -0.942689
C  1.472706 0.87157 -0.818536
C  -1.4925 0.816394 0.862791
C  3.571484 0.011159 0.058938
C  -3.577987 -0.041996 -0.04766
C  2.884458 0.891134 -0.806528
C  -2.904376 0.8148 0.850947
C  3.678931 -1.817384 1.830941
C  -3.657682 -1.803891 -1.88747
H  4.354702 -2.464276 1.243389
H  4.314086 -1.235241 2.522526
H  3.00942 -2.45611 2.423766
H  -4.300584 -1.205586 -2.557794
H  -2.97854 -2.410138 -2.503012
H  -4.32456 -2.481875 -1.325355
