program: Gaussian 09
title: 000292962
version: EM64L-G09RevD.01
frameworkgroup: C1[X(C7H5BrINO2)]
method: RPBEPBE
basis: SDD
operation: Freq
keyword: #p
keyword: freq=noraman
keyword: PBEPBE/SDD
title: #p freq=noraman PBEPBE/SDD
converged: NO YES NO NO
title: Mulliken charges:
elementType: I Br O O N C C C C C C C H H H H H
charge: 0.234173 0.078975 -0.205276 -0.178818 0.024906 0.505603 0.510515 -0.523979 -0.350887 -0.517822 -0.075381 -0.793855 0.302319 0.269470 0.231784 0.239307 0.248967
chargesum: 0.00000
title: Mulliken charges with hydrogens summed into heavy atoms:
elementType: I Br O O N C C C C C C C
charge: 0.234173 0.078975 -0.205276 -0.178818 0.024906 0.505603 0.510515 -0.221660 -0.081417 -0.517822 -0.075381 -0.073797
polarizability: 1.91996818e+02 -6.45578500e+00 1.61223366e+02 -3.79764485e-01 3.16450535e-01 4.99130775e+01
1716.lowfreq: -56.0325 -27.6427 -3.6254 -0.0008 -0.0008 -0.0007 2.9891 9.2684 37.0622
frequency: -56.0163 -27.5332 37.0565 127.3751 141.4073 163.7125 173.4467 204.6401 223.8895 299.3642 301.2307 375.9579 411.7496 482.7949 528.8808 541.7377 593.0775 669.6153 690.0201 721.7616 780.0831 889.8202 903.0170 942.2722 995.2820 1008.6122 1052.7766 1105.5386 1181.0149 1184.7702 1229.4094 1342.8795 1366.9245 1382.6909 1402.1188 1430.4516 1464.5789 1473.2853 1547.6235 1595.0672 2985.3134 3069.2309 3098.2729 3163.4141 3176.9482
redmass: 16.0651 1.0119 11.0666 71.5423 4.7253 23.4104 4.5444 7.1514 5.0118 6.9005 7.8323 7.6251 5.6762 5.8590 5.3409 3.7448 6.0723 5.3263 11.0159 6.0198 10.9430 1.4401 6.5303 1.3686 7.0885 1.4196 1.5655 2.3623 2.0033 12.5103 2.3395 4.3214 3.8907 4.9430 1.2208 5.0071 1.1232 1.0566 5.6250 6.4582 1.0390 1.0952 1.1003 1.0926 1.0916
irintensity: 0.0008 0.7446 2.2563 0.4461 0.3623 1.1894 0.8685 0.9979 1.0505 2.1012 2.4152 0.8134 1.2114 7.6464 1.2001 9.7600 5.8252 0.1516 45.2215 4.7763 2.6044 20.8383 47.7394 3.7658 26.2495 4.1483 21.2840 76.2517 3.3564 265.3196 16.0415 21.1462 46.1751 9.3804 18.9838 138.1262 22.1204 15.9159 0.6744 11.6210 19.2031 14.8649 11.3493 1.8765 6.5096
temp: 298.150 k
press: 1.00000 atm
elementType: 53 35 8 8 7 6 6 6 6 6 6 6 1 1 1 1 1
symmnumber: 1
zpe: 277887.2 jmol-1
zpe.correction: 0.105842 hartree
zpe.thermalcorrener: 0.116273 hartree
zpe.thermalcorrenthalpy: 0.117217 hartree
zpe.thermalcorrgfe: 0.066831 hartree
zpe.sumelectzpe: -498.944246 hartree
zpe.sumelectthermal: -498.933815 hartree
zpe.sumelectthermalent: -498.932870 hartree
zpe.sumelectthermalfe: -498.983257 hartree
dipole: -1.3385 4.8089 0.0715
dipole: 4.9922
quadrupole: -83.2029 -98.9558 -93.7734
quadrupole: -14.9055 -0.2730 0.1228
quadrupole: 8.7744 -6.9784 -1.7960 -14.9055 -0.2730 0.1228
hfenergy: -499.0500878 hartree
pointgroup: C01 [X(C7H5Br1I1N1O2)]
dipole: -1.918074 0.422046 -0.0220055 debye
dipolederiv: 0.0576031 0.3115094 0.0011143 0.215992 -0.2118581 -0.0016738 0.0015839 -0.0026879 0.1090043 -0.1988151 -0.3076541 -0.000378 -0.3160923 -0.4335628 -0.0008321 0.0015774 -0.0000138 0.00898 -0.602895 -0.2785482 -0.0012906 -0.1933524 -0.8679104 -0.005257 -0.0003623 -0.0050052 -0.2239952 -0.715516 0.0216719 0.0020628 0.1258617 -0.4755545 -0.003222 0.0033476 -0.0027576 -0.1902603 1.6161881 0.5304 -0.0000595 0.1154962 1.1621343 0.0096493 -0.0034286 0.0059428 0.1789076 0.1354447 -0.3872492 0.0107025 -0.3280901 0.2313148 -0.0139836 0.054872 -0.0624851 -0.0055102 -0.6976483 -0.2142492 0.0029883 -0.0761923 -0.0880683 -0.0006207 -0.0021316 0.0043192 0.1282942 0.0043598 0.2810762 -0.0029441 -0.0760658 -0.2608521 -0.0063475 -0.010885 -0.0035028 -0.133904 0.0021468 -0.0654602 0.0050181 -0.0721548 -0.2075154 0.0036281 -0.0008675 0.0128524 -0.0768976 0.2054897 -0.6669612 -0.0058666 -0.4016257 0.4141232 0.0074028 -0.0022454 0.0062783 -0.1449718 0.0891575 0.6989953 0.0005607 0.8975962 0.6615269 -0.0043553 -0.001834 0.0006225 -0.0774283 -0.0219254 0.0851994 -0.0120142 0.1194925 -0.120007 0.0104513 -0.0852796 0.1006012 0.0440215 0.1401065 -0.0160266 0.0025896 0.0063733 0.0498073 -0.0016113 0.0017139 -0.0063298 0.1664926 -0.0396529 -0.0001506 0.0011073 0.0033586 0.0916391 -0.0031249 0.0060696 -0.0035072 0.1480321 -0.0820195 0.0138618 0.0776413 -0.0748772 0.0575074 0.0413055 0.0919895 -0.0146719 0.0819948 0.0385934 -0.0716287 -0.0677123 -0.0102134 -0.0371392 -0.0763189 -0.0125553 -0.1038191 0.0620362 0.0693824 0.065214 -0.0135198 0.0644936 0.0344147 0.0449099 -0.0415645 0.074164 -0.0747959 unknown
polarizability: 162.0246504|-8.1044689|191.1970182|0.0432682|0.2089519|49.9115925 unknown
InChI: InChI=1S/C7H5BrINO2/c1-4-2-5(8)7(9)6(3-4)10(11)12/h2-3H,1H3
charge 0 multiplicity 1
17 atoms
I  1.380911 -2.792665 -0.018615
Br -2.143518 -2.896021 -0.003517
O  2.436705 1.928789 0.011914
O  3.016454 -0.262922 -0.010782
N  2.136384 0.670698 0.000659
C  -1.589211 1.277713 0.013336
C  0.675669 0.315375 0.000847
C  -0.190475 1.433885 0.012497
C  -2.103496 -0.039711 0.010523
C  0.176274 -1.024374 -0.005667
C  -1.242243 -1.156805 -0.001139
C  -2.515192 2.477374 -0.002312
H  0.268122 2.425838 0.020443
H  -3.185332 -0.202151 0.016995
H  -3.500094 2.235771 0.432163
H  -2.087906 3.323306 0.562769
H  -2.686854 2.827296 -1.038213
