program: Gaussian 09
title: 000292986
version: EM64L-G09RevD.01
frameworkgroup: C1[X(C17H16BrNO5)]
method: RPBEPBE
basis: SDD
operation: Freq
keyword: #p
keyword: freq=noraman
keyword: PBEPBE/SDD
title: #p freq=noraman PBEPBE/SDD
converged: YES YES NO NO
title: Mulliken charges:
elementType: Br O O O O O N C C C C C C C C C C C C C C C C C H H H H H H H H H H H H H H H H
charge: 0.006686 -0.231214 -0.288816 -0.283416 -0.262300 -0.240242 -0.705151 -0.342075 0.167412 0.099415 0.433941 0.350398 0.141958 0.000395 0.253273 -0.616544 0.221837 -0.381907 -0.348174 -0.246578 -0.187844 -0.536723 -0.496631 -0.534848 0.256948 0.245738 0.264897 0.332450 0.308495 0.249226 0.250946 0.201856 0.227512 0.292796 0.206788 0.225005 0.253620 0.228175 0.261378 0.221318
chargesum: 0.00000
title: Mulliken charges with hydrogens summed into heavy atoms:
elementType: Br O O O O O N C C C C C C C C C C C C C C C C C
charge: 0.006686 -0.231214 -0.288816 -0.283416 -0.262300 -0.240242 -0.064206 -0.085127 0.167412 0.099415 0.433941 0.350398 0.141958 0.000395 0.253273 -0.370805 0.221837 -0.117010 -0.098948 -0.246578 0.063102 0.185441 0.188782 0.176023
polarizability: 3.53709979e+02 2.93181074e+01 1.93069471e+02 -1.44669463e+01 1.03599635e+00 1.63131439e+02
1716.lowfreq: -6.5530 -2.9283 0.0006 0.0008 0.0008 3.0445 20.6449 29.2883 39.9497
frequency: 20.6191 29.2349 39.9394 49.8286 71.3975 76.3657 93.1674 104.8016 117.9829 120.6643 145.5776 167.9793 178.9790 182.1042 186.7758 214.7408 216.9459 236.6692 245.3096 257.2722 279.2276 295.9985 302.3351 316.3798 342.6652 352.2404 372.4913 397.5718 408.1371 430.4675 462.1524 467.0199 484.7939 496.4733 518.4712 557.0209 572.9554 595.1120 628.2727 649.8124 661.5626 669.9249 694.1895 735.7168 740.4746 751.0155 779.0317 809.2372 834.1412 855.7036 868.0051 884.8061 912.6192 929.9478 937.4862 942.3288 981.4917 989.0654 1028.5642 1077.3763 1079.4699 1107.3422 1111.6326 1114.9256 1123.7991 1132.5325 1152.9588 1155.1343 1158.1813 1192.3459 1209.8724 1222.7081 1239.7456 1252.9381 1257.6446 1312.2754 1339.4040 1371.8361 1390.6259 1403.4596 1406.7563 1428.2564 1434.9003 1445.4100 1448.4601 1452.9118 1465.4405 1470.1557 1471.4488 1479.2485 1491.9057 1495.5094 1579.9892 1586.0038 1593.2623 1629.5822 1646.7438 1679.3119 2966.5545 2968.0448 2979.6715 2980.2239 3061.0666 3081.1372 3089.7209 3119.5880 3125.3402 3137.8060 3139.8304 3150.1275 3158.6948 3177.8769 3551.7118 3691.9148
redmass: 7.4784 5.1235 4.5650 3.5705 3.5041 3.8452 3.6663 3.0156 7.3192 4.6301 1.7807 4.9371 2.5561 2.1832 2.7012 3.0596 1.3696 2.8403 5.2680 4.1541 6.5183 5.2122 4.7342 4.4755 4.0462 4.3438 1.4649 3.0822 1.2043 5.8957 7.5266 4.5352 4.5349 4.7978 5.2800 4.6648 6.1759 7.3900 6.8766 5.8403 5.6093 5.8699 5.7486 5.3292 4.1672 6.6008 6.1463 1.5579 7.7279 6.2531 1.7273 2.0361 3.0071 7.0247 1.3998 7.1305 8.8760 6.2832 2.6086 1.9755 2.1051 1.2504 1.2568 1.2509 2.3219 2.0637 1.5540 1.5071 1.5165 2.1497 1.6119 2.5710 2.4836 2.0873 1.5504 1.4011 5.0629 6.2111 6.5784 3.5835 2.7600 1.3054 1.2170 1.4484 1.0947 1.0984 1.1790 1.0518 1.0549 1.9617 2.9855 1.1922 7.9497 8.5506 6.7724 2.3251 1.7806 12.1318 1.0336 1.0328 1.0771 1.0401 1.1045 1.0992 1.0975 1.1046 1.1055 1.1000 1.0922 1.0912 1.0878 1.0966 1.0456 1.1035
irintensity: 0.7787 1.1175 2.1933 1.1449 3.6686 0.3409 7.6719 3.7415 0.5917 4.5744 0.8514 1.3567 0.7617 1.6164 0.2722 6.0193 0.9010 5.1682 6.2959 4.8489 2.2746 1.7118 0.9414 0.3597 1.9142 1.2571 18.7777 0.8842 238.8468 5.2595 7.4488 6.4858 3.4842 5.3016 13.8921 3.7207 21.2245 52.9374 8.1497 12.3699 2.6873 5.7966 3.3377 11.4495 0.4812 6.6703 1.5182 41.9512 60.5891 48.3878 41.7974 31.8173 9.0341 35.5559 0.7200 128.9750 28.9208 115.5681 48.1040 4.3625 6.9147 0.2031 0.0592 15.3986 27.4560 61.5189 3.2337 20.8278 8.8623 40.7517 167.3916 53.7734 95.6072 41.3619 45.8931 4.3580 273.1561 35.8655 33.2776 2.6497 37.8698 10.0861 9.9849 5.7802 21.8986 18.2772 104.6531 8.8339 44.2686 67.0267 294.0300 16.7294 2.8781 5.3344 4.2649 28.8073 198.4603 419.7180 104.8019 50.5953 30.7661 83.4201 32.9076 27.5993 48.8486 9.5584 20.9929 10.2552 2.2408 6.3814 3.1248 5.5157 73.1592 44.8570
temp: 298.150 k
press: 1.00000 atm
elementType: 35 8 8 8 8 8 7 6 6 6 6 6 6 6 6 6 6 6 6 6 6 6 6 6 1 1 1 1 1 1 1 1 1 1 1 1 1 1 1 1
symmnumber: 1
zpe: 781652.4 jmol-1
zpe.correction: 0.297716 hartree
zpe.thermalcorrener: 0.321491 hartree
zpe.thermalcorrenthalpy: 0.322435 hartree
zpe.thermalcorrgfe: 0.242986 hartree
zpe.sumelectzpe: -1099.961088 hartree
zpe.sumelectthermal: -1099.937313 hartree
zpe.sumelectthermalent: -1099.936368 hartree
zpe.sumelectthermalfe: -1100.015817 hartree
dipole: -0.1771 3.3333 2.8372
dipole: 4.3808
quadrupole: -139.9756 -151.3489 -138.7842
quadrupole: -5.2861 10.5245 -12.8204
quadrupole: 3.3940 -7.9794 4.5853 -5.2861 10.5245 -12.8204
hfenergy: -1100.2588032 hartree
pointgroup: C01 [X(C17H16Br1N1O5)]
dipole: 0.1230625 1.4179792 -0.9720294 debye
polarizability: 343.6381781|-41.0422222|199.1613698|-31.5224668|7.1889449|167.111341 unknown
InChI: InChI=1S/C17H16BrNO5/c1-21-11-5-4-8(18)6-9(11)15-13-10(19)7-12(22-2)16(23-3)14(13)17(20)24-15/h4-7,15H,19H2,1-3H3
charge 0 multiplicity 1
40 atoms
Br -6.120702 1.232088 1.066613
O  -0.436575 -1.61777 1.285487
O  3.737387 -0.968739 -0.370799
O  3.995593 1.855743 -1.060319
O  -1.047281 -1.087581 -1.566248
O  1.445718 -2.89997 0.852098
N  -0.549302 2.751864 0.212386
C  -0.867823 -0.194292 1.120045
C  0.354921 0.485763 0.528088
C  1.41182 -0.440839 0.408103
C  -2.155149 -0.120971 0.314678
C  0.496662 1.83096 0.114488
C  0.908251 -1.775797 0.832747
C  2.683842 -0.076394 -0.109215
C  2.842367 1.294122 -0.497842
C  1.767141 2.208077 -0.391891
C  -2.228364 -0.578143 -1.037217
C  -3.318669 0.403032 0.920362
C  -3.449715 -0.500978 -1.748773
C  -4.525962 0.486695 0.196305
C  -4.603106 0.036528 -1.133692
C  4.279191 -1.754943 0.763657
C  5.330147 1.303341 -0.766362
C  -1.063364 -1.628446 -2.93008
H  -1.076763 0.180386 2.142659
H  1.959171 3.236507 -0.716425
H  -3.280052 0.729071 1.965704
H  -1.50008 2.43976 0.393098
H  -0.41591 3.706314 -0.108946
H  -3.519273 -0.854582 -2.781017
H  -5.543306 0.095085 -1.689197
H  4.540121 -1.084741 1.606235
H  5.188378 -2.232986 0.366837
H  3.551404 -2.51913 1.080297
H  5.464187 1.143598 0.32042
H  6.028089 2.080059 -1.11737
H  5.494187 0.355519 -1.300824
H  -1.769963 -2.476011 -3.011701
H  -0.036846 -1.980679 -3.10275
H  -1.321371 -0.844822 -3.668041
