program: Gaussian 09
title: 000292977
version: EM64L-G09RevD.01
frameworkgroup: C1[X(C14H6Br2N2O8)]
method: RPBEPBE
basis: SDD
operation: Freq
keyword: #p
keyword: freq=noraman
keyword: PBEPBE/SDD
title: #p freq=noraman PBEPBE/SDD
converged: YES YES NO NO
title: Mulliken charges:
elementType: Br Br O O O O O O O O N N C C C C C C C C C C C C C C H H H H H H
charge: 0.080758 0.080747 -0.179611 -0.179605 -0.186482 -0.186502 -0.430760 -0.430762 -0.228901 -0.228908 0.020991 0.020957 0.294140 0.294109 0.345393 0.345436 -0.319949 -0.319919 -0.499017 -0.499016 0.299636 0.299623 -0.337011 -0.337028 0.112386 0.112388 0.330118 0.330110 0.299762 0.299758 0.398580 0.398577
chargesum: 0.00000
title: Mulliken charges with hydrogens summed into heavy atoms:
elementType: Br Br O O O O O O O O N N C C C C C C C C C C C C C C
charge: 0.080758 0.080747 -0.179611 -0.179605 -0.186482 -0.186502 -0.032180 -0.032185 -0.228901 -0.228908 0.020991 0.020957 0.294140 0.294109 0.345393 0.345436 -0.319949 -0.319919 -0.168899 -0.168906 0.299636 0.299623 -0.037249 -0.037271 0.112386 0.112388
polarizability: 3.54510504e+02 1.93356573e+01 2.02668370e+02 -9.21778715e-03 -3.80118593e-03 1.87457963e+02
1716.lowfreq: -4.0338 -1.5117 -0.0001 0.0005 0.0007 3.8953 25.4284 25.5126 27.5974
frequency: 25.4211 25.5121 27.5954 37.2081 55.6408 57.7179 57.7456 72.3588 75.6929 106.2358 124.9668 127.8081 131.5432 139.7331 162.6203 187.7633 193.8838 198.5085 259.7721 265.4183 285.8056 288.4843 333.6927 334.0805 354.4336 358.1376 420.0576 467.1202 470.4619 482.0765 496.3497 502.4675 521.4606 537.3540 589.5420 602.2363 603.6291 622.8281 623.0248 666.4302 675.2947 683.0476 691.1915 692.0332 736.2774 737.1041 746.2849 746.3636 776.0142 791.8223 869.5920 885.5878 949.7514 950.1160 962.7327 963.0334 985.5485 1037.8276 1040.2490 1068.7887 1103.8634 1158.3513 1158.3774 1190.2333 1191.8431 1202.7989 1211.5951 1257.6204 1318.6611 1329.2663 1351.1603 1352.0858 1365.5736 1370.0330 1394.1584 1396.6529 1447.3367 1484.6120 1547.6335 1549.9633 1605.3111 1610.5749 1646.6761 1647.6866 3172.4462 3172.4607 3199.3856 3199.4382 3535.5735 3535.6528
redmass: 12.5926 14.7276 16.1942 16.1010 19.5233 11.7161 11.8726 21.0361 20.2477 17.5553 11.6961 9.8832 8.6788 8.9397 12.8349 13.9043 4.8095 4.6500 15.8326 12.8481 9.3299 9.5378 12.2062 11.9454 9.6723 11.2576 8.4133 6.7343 6.7888 5.5846 6.8371 5.7492 3.6345 3.7437 3.0292 4.3283 2.3453 1.9405 1.6421 5.1605 7.9823 9.3564 10.9539 11.7453 4.0789 4.1846 9.5660 9.2049 10.4753 10.7395 10.5950 9.7592 1.5066 1.5080 1.4316 1.4325 7.5115 3.6416 3.6223 2.5651 1.7058 2.0806 2.4059 1.7644 1.8134 6.8560 8.0128 2.5868 2.6106 3.7180 3.7416 3.9377 12.2441 12.3123 6.0353 6.4391 4.4729 5.1008 9.7013 9.5926 7.7045 8.2152 9.4282 9.4317 1.0932 1.0932 1.0926 1.0926 1.0644 1.0644
irintensity: 0.2860 0.2226 0.3078 0.4146 0.0277 1.6861 1.9369 0.4756 0.3232 0.0003 2.5956 0.0014 0.8277 0.8109 10.8055 0.0200 0.9477 0.7064 0.1385 0.0056 12.4447 2.7245 6.4396 0.5206 12.2860 0.0066 6.7425 12.0153 6.0513 2.4553 14.7677 23.4782 25.7852 7.6590 24.6571 142.6521 72.9574 52.4603 77.8521 0.0619 18.3444 25.9977 24.5519 37.9091 54.0621 57.7001 2.0517 7.3978 11.8143 0.8724 16.6297 13.8604 14.9680 14.8330 15.4950 8.5129 32.8549 449.4073 35.1379 34.1855 41.4496 30.3030 234.2519 7.8590 6.2521 211.4294 263.9212 10.6096 317.4101 36.0985 0.9130 0.1286 298.2819 9.5044 134.9942 27.6552 28.9984 0.1660 13.8613 8.8357 37.8692 5.2098 411.0746 155.9498 2.7325 8.9184 14.8123 22.2420 146.4872 6.0217
temp: 298.150 k
press: 1.00000 atm
elementType: 35 35 8 8 8 8 8 8 8 8 7 7 6 6 6 6 6 6 6 6 6 6 6 6 6 6 1 1 1 1 1 1
symmnumber: 1
zpe: 488007.6 jmol-1
zpe.correction: 0.185872 hartree
zpe.thermalcorrener: 0.209784 hartree
zpe.thermalcorrenthalpy: 0.210728 hartree
zpe.thermalcorrgfe: 0.128093 hartree
zpe.sumelectzpe: -1273.323290 hartree
zpe.sumelectthermal: -1273.299379 hartree
zpe.sumelectthermalent: -1273.298434 hartree
zpe.sumelectthermalfe: -1273.381070 hartree
dipole: -0.0010 -0.0008 -2.2318
dipole: 2.2318
quadrupole: -135.3145 -178.0729 -178.8604
quadrupole: 12.1726 0.0023 -0.0013
quadrupole: 28.7681 -13.9903 -14.7778 12.1726 0.0023 -0.0013
hfenergy: -1273.5091627 hartree
pointgroup: C01 [X(C14H6Br2N2O8)]
dipole: -0.0003836 -0.0003369 -0.8780627 debye
polarizability: 354.1528847|20.6891617|203.0259892|-0.0091835|-0.0038834|187.4579626 unknown
InChI: InChI=1S/C14H6Br2N2O8/c15-7-1-5(13(19)20)3-9(17(23)24)11(7)12-8(16)2-6(14(21)22)4-10(12)18(25)26/h1-4,19,21H
charge 0 multiplicity 1
32 atoms
Br -0.407482 2.136893 -2.170039
Br 0.407201 -2.136513 -2.170283
O  -1.725825 -2.668594 2.124063
O  1.726117 2.669019 2.123409
O  0.297088 -1.666121 1.836228
O  -0.296718 1.665938 1.837016
O  -5.739005 -0.769569 0.353218
O  5.739005 0.769296 0.353131
O  -5.71051 0.905789 -1.26105
O  5.710354 -0.905794 -1.261412
N  -0.963772 -1.783482 1.582423
N  0.964065 1.783316 1.582758
C  -0.750634 0.030244 -0.159302
C  0.750565 -0.030159 -0.159327
C  -1.575492 -0.836138 0.613065
C  1.575523 0.836047 0.613177
C  -1.428928 0.908428 -1.047104
C  1.428778 -0.908262 -1.047256
C  -2.978039 -0.83221 0.531639
C  2.978057 0.832075 0.531657
C  -3.60854 0.066704 -0.352736
C  3.608464 -0.066742 -0.352879
C  -2.829543 0.94234 -1.146263
C  2.829388 -0.942232 -1.146485
C  -5.0929 0.136538 -0.48986
C  5.092816 -0.136633 -0.490075
H  -3.561633 -1.515586 1.151524
H  3.561725 1.515346 1.151597
H  -3.335286 1.632719 -1.827624
H  3.33507 -1.632549 -1.827953
H  -6.723698 -0.691662 0.236892
H  6.723689 0.691354 0.236751
