program: Gaussian 09
title: 000292990
version: EM64L-G09RevD.01
frameworkgroup: C1[X(C14H4Cl6O4)]
method: RPBEPBE
basis: SDD
operation: Freq
keyword: #p
keyword: freq=noraman
keyword: PBEPBE/SDD
title: #p freq=noraman PBEPBE/SDD
converged: YES YES NO NO
title: Mulliken charges:
elementType: Cl Cl Cl Cl Cl Cl O O O O C C C C C C C C C C C C C C H H H H
charge: 0.025081 0.025082 0.010290 0.010290 0.012331 0.012331 -0.381948 -0.381948 -0.182547 -0.182546 0.530835 0.530836 -0.472174 -0.472175 -0.303744 -0.303744 0.620010 0.620009 -0.241466 -0.241466 -0.345817 -0.345817 0.044088 0.044088 0.291259 0.291258 0.393802 0.393802
chargesum: 0.00000
title: Mulliken charges with hydrogens summed into heavy atoms:
elementType: Cl Cl Cl Cl Cl Cl O O O O C C C C C C C C C C C C C C
charge: 0.025081 0.025082 0.010290 0.010290 0.012331 0.012331 0.011855 0.011854 -0.182547 -0.182546 0.530835 0.530836 -0.472174 -0.472175 -0.303744 -0.303744 0.620010 0.620009 0.049792 0.049792 -0.345817 -0.345817 0.044088 0.044088
polarizability: 3.08707019e+02 -5.20293761e-05 1.86733725e+02 3.97215308e+00 -1.71949184e-05 1.85661915e+02
1716.lowfreq: -4.3664 -2.8736 -2.0080 0.0017 0.0019 0.0028 15.6769 16.9644 17.3883
frequency: 15.6206 16.9637 17.3353 30.2220 30.7976 57.7654 59.3025 87.3845 88.3651 115.7001 130.0207 141.1801 144.5931 146.0857 175.8084 175.8132 191.2430 198.0737 200.6026 229.6508 282.9522 282.9567 332.9360 336.0902 349.2492 349.3048 418.5895 438.1521 443.3171 454.5213 466.6451 505.8596 510.6139 541.8295 542.6630 558.2288 610.5106 623.7374 652.2765 657.8319 679.0514 688.6705 728.5078 732.9514 759.9370 771.1602 774.5667 775.0236 804.7525 864.4814 864.7181 900.0330 1002.8831 1041.4169 1077.6969 1096.9910 1132.8558 1174.0726 1176.7204 1242.8968 1287.1030 1288.3118 1326.8591 1345.4438 1347.0832 1379.6689 1412.2271 1448.8619 1548.1934 1554.4836 1578.9862 1593.3549 1659.8620 1660.0378 3189.8518 3189.8605 3501.6129 3501.6553
redmass: 12.5247 10.4194 10.8400 21.6131 23.4472 14.1357 14.6632 21.5785 23.5891 13.6426 10.4648 15.9341 12.0844 13.6284 22.0072 23.3525 23.7247 7.1908 7.0506 22.1983 15.5693 14.9534 9.9182 10.0903 32.2373 32.6025 9.7024 8.4265 10.1360 6.8305 6.0790 8.3965 7.0340 4.1557 4.1009 3.7480 1.4117 1.5957 6.9232 5.9707 6.4296 6.3718 7.1296 8.5896 11.4700 8.7918 8.4496 9.3038 9.8175 1.4307 1.4309 9.1813 7.2653 3.4759 3.4299 6.3804 2.8781 1.5489 1.8707 3.3664 3.0309 3.0103 5.9700 10.3017 10.0011 7.9876 4.0079 5.0438 11.0830 11.0155 10.1565 10.9043 10.2823 10.2932 1.0937 1.0937 1.0639 1.0639
irintensity: 0.5291 3.6020 0.1773 0.1185 0.0017 0.8910 0.0542 0.1033 0.0027 0.0028 0.5852 0.1495 0.4169 0.0530 0.0236 0.3574 0.6921 0.4535 3.5905 0.0615 0.1426 1.2396 0.0776 0.1587 0.1142 0.0117 10.3265 4.4537 2.1798 5.4513 36.8302 15.6826 23.6052 11.9771 30.9606 57.5231 187.6140 1.9180 10.7365 8.1240 21.7841 1.1205 31.1089 12.4237 119.9312 32.8769 1.0768 20.6517 49.1673 16.8538 19.1728 5.8825 19.8481 426.9107 117.4208 55.1956 15.7684 22.1345 3.6845 6.8858 39.4785 114.8702 149.1219 0.2412 8.1321 1.1322 55.0120 0.0077 75.5987 113.8534 164.7238 22.1665 435.6575 42.0437 2.9925 3.8118 20.5070 61.2154
temp: 298.150 k
press: 1.00000 atm
elementType: 17 17 17 17 17 17 8 8 8 8 6 6 6 6 6 6 6 6 6 6 6 6 6 6 1 1 1 1
symmnumber: 1
zpe: 381092.2 jmol-1
zpe.correction: 0.145150 hartree
zpe.thermalcorrener: 0.168983 hartree
zpe.thermalcorrenthalpy: 0.169927 hartree
zpe.thermalcorrgfe: 0.085935 hartree
zpe.sumelectzpe: -3595.455986 hartree
zpe.sumelectthermal: -3595.432154 hartree
zpe.sumelectthermalent: -3595.431210 hartree
zpe.sumelectthermalfe: -3595.515202 hartree
dipole: 0.0000 -1.3570 0.0000
dipole: 1.3570
quadrupole: -174.7345 -162.9475 -184.2360
quadrupole: 0.0000 13.1374 0.0001
quadrupole: -0.7619 11.0252 -10.2633 0.0000 13.1374 0.0001
hfenergy: -3595.6011366 hartree
pointgroup: C01 [X(C14H4Cl6O4)]
dipole: -0.0000116 -0.533904 -0.0000227 debye
polarizability: 307.975087|-0.0026904|186.7337246|10.261724|-0.0002045|186.3938472 unknown
InChI: InChI=1S/C14H4Cl6O4/c15-3-1-5(17)9(13(21)22)11(19)7(3)8-4(16)2-6(18)10(12(8)20)14(23)24/h1-2,21,23H
charge 0 multiplicity 1
28 atoms
Cl -1.078096 -1.448239 1.753837
Cl 1.078024 -1.448155 -1.753927
Cl -0.093251 2.47641 -2.071078
Cl 0.093324 2.476262 2.071262
Cl -5.213365 0.53285 -1.384417
Cl 5.213365 0.532554 1.38447
O  -4.127726 -2.473895 0.230602
O  4.127613 -2.474033 -0.230764
O  -4.630687 -0.918582 1.887422
O  4.630638 -0.918622 -1.887471
C  -0.722176 0.512119 -0.189658
C  0.722177 0.512079 0.189705
C  -1.660552 -0.335364 0.447062
C  1.660521 -0.335394 -0.447075
C  -1.226148 1.360211 -1.206013
C  1.22618 1.360081 1.20612
C  -3.032608 -0.355588 0.114901
C  3.032577 -0.355692 -0.114915
C  -2.581807 1.378334 -1.579625
C  2.581839 1.378126 1.579734
C  -3.465056 0.514935 -0.9090
C  3.465056 0.514741 0.909049
C  -4.006855 -1.236866 0.857286
C  4.006791 -1.236955 -0.857361
H  -2.938072 2.043242 -2.368991
H  2.938129 2.042965 2.369148
H  -4.774762 -3.044197 0.730702
H  4.774628 -3.044325 -0.730904
