program: Gaussian 09
title: 000292964
version: EM64L-G09RevD.01
frameworkgroup: C1[X(C10H12FNO2)]
method: RPBEPBE
basis: SDD
operation: Freq
keyword: #p
keyword: freq=noraman
keyword: PBEPBE/SDD
title: #p freq=noraman PBEPBE/SDD
converged: YES YES NO NO
title: Mulliken charges:
elementType: F O O N C C C C C C C C C C H H H H H H H H H H H H
charge: -0.186051 -0.261696 -0.259775 -0.679279 0.426426 0.175853 0.351832 0.104809 -0.636821 0.034947 -0.856462 -0.791480 0.264968 -0.746462 0.237359 0.230104 0.240454 0.227961 0.217704 0.239480 0.239334 0.317286 0.348531 0.254410 0.245096 0.261473
chargesum: 0.00000
title: Mulliken charges with hydrogens summed into heavy atoms:
elementType: F O O N C C C C C C C C C C
charge: -0.186051 -0.261696 -0.259775 -0.013462 0.426426 0.175853 0.351832 0.104809 -0.399463 0.034947 -0.157942 -0.094963 0.264968 0.014518
polarizability: 1.64515325e+02 -3.69115297e+00 1.45255454e+02 1.88603582e+00 5.92445589e-01 7.16073510e+01
1716.lowfreq: -9.4052 -7.1758 -0.0006 0.0004 0.0005 6.5648 45.1327 57.6828 69.6730
frequency: 45.1245 57.6767 69.6713 78.3834 96.7472 120.6598 161.6077 196.3586 200.5166 253.0424 264.4478 276.4927 319.2424 331.5253 344.3535 356.7930 423.7571 431.6218 482.8579 527.0722 539.4199 550.6125 578.7526 610.8934 627.4219 665.6531 695.5428 745.2110 816.0833 878.0346 879.0409 949.9394 992.5109 1016.2064 1024.1099 1041.0282 1041.6767 1048.9978 1087.5014 1146.0772 1192.7967 1213.5431 1270.4201 1347.6282 1382.8353 1385.5436 1398.2848 1402.8761 1427.1022 1451.5619 1451.6919 1462.6550 1472.9346 1474.9110 1486.4777 1506.8072 1579.1447 1615.8837 1644.0067 1665.4214 2953.5162 2983.0961 3010.3533 3021.1236 3060.7856 3086.1629 3091.0946 3098.2097 3128.5056 3146.4793 3472.8321 3649.1005
redmass: 1.4905 5.0060 1.0795 1.8812 3.8724 5.2464 2.5519 1.2803 3.7676 2.9690 6.7874 4.5288 3.1740 3.9451 3.9779 4.1435 1.1994 5.6940 5.8422 4.0378 4.3377 3.2169 2.4725 1.7414 3.5883 5.1436 5.3284 6.1894 6.5523 1.3280 3.6603 2.8309 1.7029 1.5742 2.1694 1.6309 1.4854 1.5040 4.6650 1.8057 4.0835 2.9414 1.7810 6.5306 2.9567 1.2786 1.5071 1.2561 3.2715 1.0650 1.0521 1.0447 1.0677 1.1869 1.3382 3.0310 7.1041 2.2336 8.3806 1.8310 1.0395 1.0368 1.0368 1.0976 1.0978 1.0954 1.0993 1.0972 1.0915 1.1014 1.0516 1.0957
irintensity: 3.9075 1.1276 0.1448 2.6404 0.3930 1.0199 6.7737 0.1804 2.1462 1.3538 3.0897 1.4920 0.9366 6.6485 1.6700 1.5267 45.5631 1.7781 10.8440 7.0180 3.6032 13.3724 53.2197 151.6813 52.2326 17.2198 7.4397 8.3213 8.8145 11.6213 9.0164 16.3581 27.2536 25.6985 53.6627 11.4634 0.2398 11.0855 65.0529 83.3609 353.9988 47.4045 0.4036 20.3343 36.0412 40.5437 22.8612 5.9269 10.9050 29.0876 22.4478 11.1524 14.2381 9.3579 36.2374 98.4868 21.8550 194.1485 128.5121 34.5149 42.4704 40.6191 1.0278 24.4904 18.4546 14.2000 17.0875 4.5583 16.5522 9.8117 88.7393 47.5596
temp: 298.150 k
press: 1.00000 atm
elementType: 9 8 8 7 6 6 6 6 6 6 6 6 6 6 1 1 1 1 1 1 1 1 1 1 1 1
symmnumber: 1
zpe: 529386.1 jmol-1
zpe.correction: 0.201633 hartree
zpe.thermalcorrener: 0.216614 hartree
zpe.thermalcorrenthalpy: 0.217559 hartree
zpe.thermalcorrgfe: 0.159391 hartree
zpe.sumelectzpe: -692.275149 hartree
zpe.sumelectthermal: -692.260167 hartree
zpe.sumelectthermalent: -692.259223 hartree
zpe.sumelectthermalfe: -692.317390 hartree
dipole: 0.4650 1.8002 -0.7289
dipole: 1.9970
quadrupole: -67.4872 -75.7608 -87.1487
quadrupole: 4.0117 4.3012 -2.0327
quadrupole: 9.3117 1.0381 -10.3498 4.0117 4.3012 -2.0327
hfenergy: -692.4767812 hartree
pointgroup: C01 [X(C10H12F1N1O2)]
dipole: -0.2901906 -0.6923248 -0.2319091 debye
dipolederiv: -0.3995503 -0.355747 0.0321227 -0.2818288 -0.8134054 0.0539347 0.0250972 0.0573019 -0.1281558 -1.7082093 0.2135049 -0.1743059 0.2838588 -0.351581 0.1371949 -0.2799299 0.1934798 -0.3694673 -0.6545734 -0.0789932 0.0974075 0.2572565 -0.5940457 0.3477896 -0.4069881 0.3058053 -0.6802961 -0.5870402 0.5268713 0.1497168 0.395446 -1.0371209 -0.0920622 0.1636556 -0.2669852 -0.5995313 -0.0347556 0.4831895 0.0154856 0.0673983 -0.0028535 -0.0198261 -0.023057 0.0090977 -0.0593034 0.135497 -0.6174763 -0.0737946 -0.4911223 0.9031157 0.1129752 -0.0242208 0.0291664 0.0671156 -0.2920236 -0.2556994 0.0135673 -0.1493858 -0.0289563 0.0103263 0.0295714 0.0366234 -0.0639626 0.7655341 -0.1252239 -0.0778908 0.2856375 -0.1902045 0.0277377 -0.1866862 -0.0188745 0.0035333 0.0518707 -0.0302108 -0.0289754 0.1409176 0.1665912 -0.0005869 -0.0269656 0.0024733 -0.1797314 0.5564413 0.4203188 -0.0573474 0.0710314 0.796988 -0.0598655 0.0107507 -0.0621604 0.05615 0.0245112 -0.0402222 0.0096073 -0.0241179 -0.0476827 0.0073543 0.0008911 0.0193786 0.0972711 0.0972502 0.0004507 -0.0040474 0.0372278 -0.0526544 -0.0043462 -0.0197964 -0.0030416 0.0874425 1.8791093 -0.0656886 0.0787776 -0.523732 0.6768067 -0.5822724 0.6258313 -0.5560861 0.8609435 -0.3293921 -0.1033776 0.1157953 -0.1634492 -0.0628574 0.0856607 0.2167943 0.0704902 -0.0573358 -0.1175998 -0.0002511 0.0233047 -0.0024515 0.086163 0.0008971 0.0279348 -0.0085749 0.1432885 0.0675269 0.0436324 -0.0909616 -0.0313614 -0.0474619 0.0940114 -0.0261916 0.1175895 -0.0395445 -0.1316624 -0.0229502 0.0270035 0.0912794 0.0885141 -0.0109546 0.0249635 0.0037119 0.1082154 0.0800814 0.0121886 0.0568644 -0.0554017 -0.0600605 -0.088714 -0.000317 -0.1303797 -0.0563238 -0.144728 0.0273613 0.030718 -0.0792604 0.0681469 0.0119078 0.0337387 -0.0031167 0.101917 0.056295 -0.0175683 -0.0752648 0.0262323 -0.0399959 -0.0870162 -0.0189566 -0.1327024 -0.0207035 0.0692852 0.0240553 0.0469604 0.0551246 -0.0294118 0.0803015 -0.0097065 0.1335626 -0.0547341 0.1586903 -0.058382 -0.021116 -0.059485 0.193527 0.0183848 -0.0129378 0.0620785 0.3195727 0.3352195 -0.0211219 -0.0544924 0.0673526 0.2237812 -0.0186805 -0.0459889 0.1574033 0.3108903 0.0697497 -0.0195078 -0.0228138 0.0162783 0.1271342 -0.0452775 0.005709 -0.0324222 -0.0511343 -0.0395148 0.0403588 -0.0356431 0.0795243 0.0711234 0.0556545 -0.0687784 0.0549209 0.0712299 0.0919878 0.0204884 0.0193221 -0.0129692 -0.0435997 -0.0345284 -0.0144168 -0.0387397 0.1326543 unknown
polarizability: 162.9189524|-6.5776161|146.3221444|-3.4038919|-5.5185015|72.1370334 unknown
InChI: InChI=1S/C10H12FNO2/c1-5-4-6(2)9(12)10(8(5)11)14-7(3)13/h4H,12H2,1-3H3
charge 0 multiplicity 1
26 atoms
F  0.321697 2.455596 -0.196188
O  1.71605 0.195314 -0.494587
O  2.628398 -1.24207 1.117026
N  0.351053 -2.421881 -0.090665
C  -1.770011 -1.185077 0.106478
C  -0.340306 -1.210014 -0.027491
C  -1.791675 1.30258 0.052582
C  0.335781 0.040681 -0.143944
C  -2.450642 0.049688 0.135298
C  -0.395263 1.245135 -0.09089
C  -2.530779 -2.493758 0.215474
C  -2.524559 2.627209 0.108582
C  2.777567 -0.405462 0.195818
C  4.088742 0.102194 -0.354885
H  -3.542096 0.043956 0.240672
H  -2.193635 -3.094578 1.084248
H  -3.610403 -2.310264 0.341998
H  -2.410983 -3.123024 -0.689863
H  -3.605804 2.465966 0.256058
H  -2.155432 3.261013 0.935578
H  -2.387577 3.207027 -0.822851
H  -0.190345 -3.282292 -0.054014
H  1.299516 -2.449276 0.292335
H  4.135782 -0.064989 -1.444475
H  4.923665 -0.411266 0.142324
H  4.165858 1.190895 -0.189516
