program: Gaussian 09
title: 000292979
version: EM64L-G09RevD.01
frameworkgroup: C1[X(C22H20Br2O2)]
method: RPBEPBE
basis: SDD
operation: Freq
keyword: #p
keyword: freq=noraman
keyword: PBEPBE/SDD
title: #p freq=noraman PBEPBE/SDD
converged: YES YES NO NO
title: Mulliken charges:
elementType: Br Br O O C C C C C C C C C C C C C C C C C C C C C C H H H H H H H H H H H H H H H H H H H H
charge: 0.046159 0.046156 -0.383335 -0.383336 0.320890 0.320895 0.058095 0.058106 0.341624 0.341627 0.291782 0.291778 -0.698522 -0.698520 -0.325889 -0.325904 -0.573818 -0.573869 0.456227 0.456228 -0.413922 -0.413878 -0.836987 -0.836986 -0.811595 -0.811596 0.256615 0.256617 0.238920 0.238921 0.237033 0.237033 0.227166 0.241157 0.259580 0.227167 0.259582 0.241154 0.225847 0.226858 0.240273 0.240275 0.226857 0.225849 0.375842 0.375842
chargesum: 0.00000
title: Mulliken charges with hydrogens summed into heavy atoms:
elementType: Br Br O O C C C C C C C C C C C C C C C C C C C C C C
charge: 0.046159 0.046156 -0.007493 -0.007494 0.320890 0.320895 0.058095 0.058106 0.341624 0.341627 0.291782 0.291778 -0.698522 -0.698520 -0.069274 -0.069287 -0.334898 -0.334948 0.456227 0.456228 -0.176889 -0.176845 -0.109084 -0.109083 -0.118616 -0.118616
polarizability: 4.22967332e+02 -4.35419230e-01 2.37093507e+02 1.29337597e-02 -2.37589159e-02 2.13481185e+02
1716.lowfreq: -7.6349 -0.0004 0.0007 0.0007 5.4511 6.2223 18.6552 21.6265 22.9263
frequency: 18.6540 21.5818 22.8395 27.6419 30.4293 35.7048 46.4668 64.5185 64.8934 98.2137 101.3571 119.5104 127.2589 127.8965 135.9413 140.7697 162.8664 204.0645 205.1472 205.2128 230.1019 260.7305 262.5688 281.1886 287.3038 298.4202 346.6798 354.8042 365.5442 384.8262 427.8473 446.5564 447.7444 458.6892 463.2286 469.0953 484.8728 505.2380 529.6737 539.5222 553.5595 556.3627 558.1028 624.1867 642.7293 657.7626 691.3953 716.9068 718.0840 729.2864 754.5194 795.6814 802.0120 821.7302 834.6234 837.6362 894.4097 894.5748 910.7065 926.0358 944.4228 964.6734 965.0186 982.3090 982.4363 1020.4217 1020.5341 1043.3613 1044.3931 1045.4081 1049.1295 1051.2480 1121.8842 1135.6417 1155.2625 1166.5800 1176.1091 1185.8771 1214.7822 1237.1443 1248.4166 1251.8077 1288.4406 1288.6949 1334.0184 1354.9641 1357.6101 1361.4020 1396.2286 1397.5902 1398.4401 1400.5868 1402.7349 1405.1415 1426.4258 1447.3179 1464.4338 1464.7641 1469.3177 1470.4341 1472.9403 1472.9801 1474.6467 1475.0577 1498.5694 1507.5470 1519.5406 1572.0583 1572.4016 1617.2950 1619.4920 1623.8640 2977.3662 2977.4152 2978.5971 2978.7601 3057.2754 3057.2918 3059.1040 3059.1063 3087.2290 3087.3840 3087.4921 3087.5733 3116.2658 3116.3165 3124.2871 3124.3489 3147.4177 3147.4622 3475.5886 3477.9968
redmass: 3.4286 1.6922 1.1145 1.7933 3.3954 4.2924 6.6844 10.4543 5.8996 1.0430 1.0496 13.0636 6.4324 4.5454 6.3337 4.2457 5.5070 6.2347 2.8523 4.6326 6.5598 3.4684 6.2332 2.6338 6.9399 4.3775 7.0903 4.1879 4.2791 4.1573 2.9283 3.0826 2.8613 1.3427 1.3819 3.3371 3.4436 4.6421 5.5986 3.4959 5.4612 4.6968 3.5060 9.8767 4.6886 3.7504 8.7838 5.6607 5.5668 3.8913 3.8032 9.9228 7.7875 2.2909 1.3807 2.2905 1.2887 1.2857 4.3961 3.3324 5.2449 1.3417 1.3432 1.4933 1.5128 1.4981 1.5014 2.0861 1.5301 2.0483 1.5821 2.0854 2.1395 1.9021 1.9449 1.8438 1.6003 2.0126 1.6456 2.1068 2.3205 2.9866 1.6068 1.5886 8.1527 5.3621 7.0918 5.0170 1.7289 1.2586 1.3913 1.5205 1.4853 1.9711 5.7746 3.4739 1.0524 1.0498 1.1242 1.1113 1.0791 1.0681 1.2174 1.1886 2.3863 3.2429 8.5824 6.2539 6.2691 6.7544 6.2475 7.6524 1.0385 1.0385 1.0374 1.0374 1.0970 1.0970 1.0952 1.0952 1.0994 1.0996 1.0998 1.0995 1.0912 1.0912 1.0875 1.0875 1.0971 1.0971 1.0644 1.0647
irintensity: 0.9907 0.0614 0.0244 0.4459 0.0247 0.8692 0.0059 0.1189 0.0376 0.8397 0.0398 0.0969 0.0801 0.0441 0.1689 0.0211 0.0294 0.0187 5.1725 0.1504 0.0158 2.4346 1.4433 0.8785 13.9484 0.9253 0.0792 1.0907 3.0721 0.3622 0.2959 0.0290 10.3737 3.7713 116.5426 33.3246 4.8448 7.6266 0.3589 0.0001 0.0228 5.0911 8.2491 1.0415 13.6887 0.0861 0.2761 0.0509 7.7114 4.3733 0.0014 5.0523 0.2809 172.1468 0.1436 10.0227 0.2571 3.4598 0.3962 12.4668 0.3013 0.9043 0.2937 2.0757 0.0004 6.3958 3.6955 2.4625 0.1363 12.0439 0.6128 42.5562 4.2229 42.0765 294.1588 4.9489 54.7643 0.0255 0.0019 62.0310 0.0896 27.6329 4.0453 0.7159 230.5412 0.2711 0.2708 0.3128 7.0827 2.5245 18.7832 20.6670 4.4309 2.7416 76.9205 26.5573 27.6317 0.8485 4.6108 4.6674 5.1347 26.1313 46.5132 26.9077 0.4543 47.3578 0.0163 0.9282 3.0096 3.4096 31.6460 1.1084 76.9182 1.3941 0.6165 31.6492 0.7266 14.7194 3.3616 38.4035 32.2612 3.3892 5.3898 47.0925 18.3594 28.4730 23.8844 1.0088 3.6369 23.4578 249.6315 0.0225
temp: 298.150 k
press: 1.00000 atm
elementType: 35 35 8 8 6 6 6 6 6 6 6 6 6 6 6 6 6 6 6 6 6 6 6 6 6 6 1 1 1 1 1 1 1 1 1 1 1 1 1 1 1 1 1 1 1 1
symmnumber: 1
zpe: 924186.9 jmol-1
zpe.correction: 0.352004 hartree
zpe.thermalcorrener: 0.379196 hartree
zpe.thermalcorrenthalpy: 0.380141 hartree
zpe.thermalcorrgfe: 0.289479 hartree
zpe.sumelectzpe: -1025.879075 hartree
zpe.sumelectthermal: -1025.851883 hartree
zpe.sumelectthermalent: -1025.850939 hartree
zpe.sumelectthermalfe: -1025.941600 hartree
dipole: 0.0000 0.0000 0.7831
dipole: 0.7831
quadrupole: -125.6261 -186.7248 -160.5943
quadrupole: 11.3681 -0.0005 -0.0007
quadrupole: 32.0223 -29.0764 -2.9459 11.3681 -0.0005 -0.0007
hfenergy: -1026.2310792 hartree
pointgroup: C01 [X(C22H20Br2O2)]
dipole: -0.0000096 -0.0001661 0.3080785 debye
polarizability: 420.916168|-19.4226683|239.1446903|0.004509|-0.0109782|213.4811656 unknown
InChI: InChI=1S/C22H20Br2O2/c1-11-5-7-15(13(3)9-11)17-19(23)22(26)18(20(24)21(17)25)16-8-6-12(2)10-14(16)4/h5-10,25-26H,1-4H3
charge 0 multiplicity 1
46 atoms
Br 1.558867 -2.968482 -0.195171
Br -1.559518 2.968589 -0.191818
O  -1.442656 -2.412409 -0.174519
O  1.442003 2.4125 -0.171691
C  -1.435183 0.046713 -0.163285
C  1.434536 -0.046635 -0.163261
C  -2.935736 0.009256 -0.164556
C  2.935088 -0.009177 -0.164411
C  -3.682101 0.135892 1.047501
C  3.681394 -0.137282 1.047527
C  -0.743142 -1.20137 -0.172557
C  0.742493 1.201458 -0.171161
C  0.669886 -1.234589 -0.168945
C  -0.670535 1.234671 -0.167585
C  -3.623545 -0.193493 -1.388792
C  3.622959 0.195074 -1.388366
C  -5.094803 0.068523 0.979909
C  5.094102 -0.069828 0.980084
C  -5.791935 -0.11576 -0.241654
C  5.791292 0.115961 -0.241217
C  -5.032902 -0.254173 -1.430071
C  5.032315 0.255823 -1.429501
C  -2.983029 0.343387 2.378226
C  2.982257 -0.34639 2.377963
C  -7.309786 -0.14195 -0.273899
C  7.309143 0.142207 -0.273368
H  -3.044176 -0.289383 -2.314307
H  3.043638 0.292072 -2.313795
H  -5.670048 0.165173 1.90976
H  5.669301 -0.167608 1.909845
H  -5.543447 -0.40601 -2.388252
H  5.542903 0.408835 -2.387472
H  -3.698328 0.29633 3.216657
H  -2.199244 -0.417268 2.549756
H  -2.483623 1.329979 2.410681
H  3.697544 -0.300527 3.216471
H  2.482694 -1.332944 2.409127
H  2.198592 0.414171 2.550456
H  -7.688087 -0.722572 -1.133206
H  -7.728773 -0.581105 0.648604
H  -7.718905 0.883157 -0.363772
H  7.718267 -0.882744 -0.364985
H  7.728104 0.57979 0.649891
H  7.687473 0.724293 -1.131674
H  -2.418849 -2.222151 -0.219926
H  2.418201 2.222299 -0.217239
