program: Gaussian 09
title: 000292955
version: EM64L-G09RevD.01
frameworkgroup: C1[X(C13H13NO2)]
method: RPBEPBE
basis: SDD
operation: Freq
keyword: #p
keyword: freq=noraman
keyword: PBEPBE/SDD
title: #p freq=noraman PBEPBE/SDD
converged: YES YES NO NO
title: Mulliken charges:
elementType: O O N C C C C C C C C C C C C C H H H H H H H H H H H H H
charge: -0.442081 -0.278495 -0.351137 0.248165 0.339158 0.111827 0.390947 -0.480416 -0.763916 -0.791656 -0.367427 -0.367257 0.064154 -0.203612 -0.203588 -0.235493 0.279368 0.228623 0.254039 0.254232 0.243350 0.238053 0.238051 0.259634 0.259636 0.234327 0.234327 0.234853 0.372334
chargesum: 0.00000
title: Mulliken charges with hydrogens summed into heavy atoms:
elementType: O O N C C C C C C C C C C C C C
charge: -0.069747 -0.278495 -0.351137 0.248165 0.339158 0.111827 0.390947 -0.201048 -0.027021 -0.072202 -0.107793 -0.107621 0.064154 0.030714 0.030740 -0.000641
polarizability: 2.17003600e+02 -2.91419482e+00 1.30368002e+02 2.77553970e-02 4.57758247e-02 1.09425333e+02
1716.lowfreq: -107.7013 -29.9784 -12.8039 -0.0009 -0.0006 0.0005 3.1298 6.1991 45.3325
frequency: -107.6801 -29.6891 45.2161 68.7064 79.0875 114.1937 148.2656 156.3251 172.7433 237.3388 253.9687 291.1485 295.8005 379.1343 408.0034 409.0908 430.2146 493.2189 550.7510 581.1216 595.6681 605.3682 629.9065 632.9727 655.5174 701.3234 704.2743 741.9090 758.7482 806.9125 840.5995 853.2033 928.2651 973.2662 979.2062 980.7878 990.4871 1000.1748 1001.2878 1027.1459 1030.5248 1034.6094 1048.2166 1075.5763 1135.8046 1157.8729 1173.3620 1178.7292 1239.0954 1273.2776 1308.2210 1326.6376 1376.2589 1380.3491 1406.6748 1408.7392 1414.1322 1436.3429 1450.5117 1462.5703 1469.8474 1477.0848 1488.9252 1537.9727 1585.5809 1593.4934 1608.9103 1645.0702 2971.8599 2991.4474 3041.6879 3069.0132 3096.7105 3097.2577 3132.0756 3139.6900 3150.8937 3159.0680 3171.5471 3234.6562 3525.6131
redmass: 1.0135 3.8710 4.9513 4.9961 8.2309 1.1407 2.6013 4.9430 3.9844 3.2733 3.8902 4.5637 3.6968 4.7149 3.2037 4.2583 5.4644 3.8256 1.3336 3.5513 3.7896 6.0067 2.8276 5.0793 6.1964 2.4575 3.2954 5.8241 1.9474 3.0056 1.3661 1.2404 1.4250 1.9492 2.7988 1.3798 5.4274 1.3904 4.4476 1.8601 1.9537 1.4371 1.4512 1.5384 1.6106 1.8675 1.0554 1.1157 4.6824 2.4201 1.3381 6.2478 9.0438 4.2626 1.4193 1.3131 2.5099 2.1616 1.0496 1.0460 1.1283 1.3085 2.4311 8.2663 6.5322 6.4627 6.2535 7.7182 1.0385 1.0365 1.0979 1.0968 1.0972 1.0997 1.0852 1.0885 1.0930 1.0973 1.1018 1.0987 1.0640
irintensity: 0.1452 0.0347 0.0736 0.4174 0.6623 0.5562 3.7023 0.4287 0.4596 0.7789 0.5510 9.3173 1.1708 0.6110 0.8797 2.0685 5.5544 14.7126 106.2631 2.8752 35.4322 0.0032 31.7843 10.0945 5.7319 23.0717 25.3189 24.8817 43.8472 16.3575 26.4533 0.0114 9.1841 58.6869 165.8357 0.0014 15.0619 3.5351 46.0014 40.2499 32.9447 1.2317 5.3393 11.2204 152.8301 18.7125 0.0019 1.4733 6.0847 33.0520 0.0125 24.5769 1.3046 27.1420 39.9120 5.2404 92.6959 7.0012 5.1040 21.2574 1.1133 17.1528 91.7543 98.4881 21.9355 3.1760 37.3800 384.7543 42.9081 15.1546 18.0924 6.7054 7.6917 27.9232 0.6263 3.1285 18.8145 18.4360 14.2370 2.1152 36.5840
temp: 298.150 k
press: 1.00000 atm
elementType: 8 8 7 6 6 6 6 6 6 6 6 6 6 6 6 6 1 1 1 1 1 1 1 1 1 1 1 1 1
symmnumber: 1
zpe: 598295.9 jmol-1
zpe.correction: 0.227879 hartree
zpe.thermalcorrener: 0.241373 hartree
zpe.thermalcorrenthalpy: 0.242317 hartree
zpe.thermalcorrgfe: 0.187309 hartree
zpe.sumelectzpe: -707.258683 hartree
zpe.sumelectthermal: -707.245188 hartree
zpe.sumelectthermalent: -707.244244 hartree
zpe.sumelectthermalfe: -707.299252 hartree
dipole: 4.8080 1.1701 0.0002
dipole: 4.9484
quadrupole: -85.2535 -96.3099 -88.4764
quadrupole: -6.6535 0.0074 0.0165
quadrupole: 4.7598 -6.2966 1.5368 -6.6535 0.0074 0.0165
hfenergy: -707.4865616 hartree
pointgroup: C01 [X(C13H13N1O2)]
dipole: -1.8861181 0.4824305 -0.0000921 debye
polarizability: 217.0598935|1.9006069|130.3117078|0.0272183|-0.0460972|109.425333 unknown
InChI: InChI=1S/C13H13NO2/c1-9-8-12(13(15)16)10(2)14(9)11-6-4-3-5-7-11/h3-8,15H,1-2H3
charge 0 multiplicity 1
29 atoms
O  4.517068 0.435479 0.001078
O  3.754306 -1.762725 0.000167
N  -0.08261 0.296121 0.000537
C  0.949396 -0.647637 0.000086
C  0.453408 1.615888 0.001178
C  2.160898 0.082544 0.000433
C  -1.497148 -0.004278 0.000153
C  1.838787 1.491934 0.001155
C  0.716232 -2.130329 -0.000838
C  -0.428798 2.831288 0.001809
C  -2.186964 -0.13776 -1.227203
C  -2.186638 -0.142894 1.227126
C  3.481049 -0.529489 0.000171
C  -3.572942 -0.41315 -1.225124
C  -3.572613 -0.418319 1.224254
C  -4.267396 -0.553003 -0.000629
H  2.561122 2.304942 0.001605
H  -0.359649 -2.373367 0.00096
H  1.188057 -2.599214 -0.882552
H  1.19153 -2.600697 0.878179
H  0.200095 3.736642 0.002881
H  -1.084805 2.874747 -0.888663
H  -1.085632 2.873177 0.891741
H  -1.635387 -0.029669 -2.167233
H  -1.634829 -0.038648 2.167453
H  -4.107434 -0.519109 -2.175319
H  -4.106851 -0.528252 2.174141
H  -5.341744 -0.767004 -0.000934
H  5.382692 -0.054818 0.001286
