program: Gaussian 09
title: 000292989
version: EM64L-G09RevD.01
frameworkgroup: C1[X(C22H26N2O2)]
method: RPBEPBE
basis: SDD
operation: Freq
keyword: #p
keyword: freq=noraman
keyword: PBEPBE/SDD
title: #p freq=noraman PBEPBE/SDD
converged: YES YES NO NO
title: Mulliken charges:
elementType: O O N N C C C C C C C C C C C C C C C C C C C C C C H H H H H H H H H H H H H H H H H H H H H H H H H H
charge: -0.254785 -0.257143 -0.454474 -0.447346 -0.381418 -0.414632 -0.377960 -0.402235 -0.408880 -0.395150 -0.560238 -0.551736 0.201718 0.194217 0.056811 0.055529 0.308655 0.310960 -0.348786 -0.345464 -0.365389 -0.368890 -0.258181 -0.259012 -0.229110 -0.228539 0.207631 0.196774 0.191561 0.240679 0.193667 0.225779 0.210278 0.194538 0.203617 0.230111 0.221353 0.210252 0.226214 0.237232 0.221364 0.242686 0.332948 0.338340 0.252645 0.252469 0.312906 0.312849 0.231729 0.231755 0.231086 0.231019
chargesum: 0.00000
title: Mulliken charges with hydrogens summed into heavy atoms:
elementType: O O N N C C C C C C C C C C C C C C C C C C C C C C
charge: -0.254785 -0.257143 -0.121526 -0.109006 0.022987 0.017607 0.041486 0.002581 0.024848 0.036454 -0.096792 -0.087686 0.201718 0.194217 0.056811 0.055529 0.308655 0.310960 -0.096141 -0.092995 -0.052483 -0.056041 -0.026452 -0.027257 0.001976 0.002479
polarizability: 2.78643604e+02 6.47143307e-01 2.54504605e+02 -1.83724918e+00 2.97046263e+01 2.38310435e+02
1716.lowfreq: -15.1341 -0.0011 -0.0008 -0.0005 3.8493 8.3708 26.2996 34.3675 46.5510
frequency: 25.5098 34.3062 46.4534 56.5813 75.8388 78.2495 87.0746 95.4270 118.5820 131.4367 145.6375 169.2623 179.9687 195.5087 213.9390 219.6028 226.1472 264.3600 277.1618 291.8636 301.6524 322.8531 339.9809 365.3606 387.0097 396.0105 400.7365 438.8407 485.4495 499.1733 511.5101 519.9204 548.1813 559.4225 572.3826 615.3989 615.7731 622.6516 665.4075 675.4186 680.0982 713.8112 720.1826 726.2023 748.7946 757.4275 763.3773 772.0309 772.4886 777.2533 820.6831 830.3493 841.9701 860.9579 881.9646 890.8079 895.6398 896.5718 913.2559 942.3413 956.6469 960.5948 962.3816 972.5426 990.0814 1001.8733 1002.0677 1013.9084 1031.7898 1039.2422 1048.4708 1074.7694 1079.8431 1092.6649 1099.8233 1118.2457 1123.6967 1130.8563 1144.8340 1166.0656 1173.0754 1173.3095 1200.0705 1212.3788 1217.4521 1221.1491 1237.1867 1247.0852 1257.2415 1277.0902 1289.4747 1293.0566 1293.7278 1295.8396 1307.2002 1317.6605 1336.3893 1341.8485 1347.4887 1356.5482 1359.4833 1362.3069 1362.9169 1371.1255 1426.2389 1441.4446 1448.8556 1449.7448 1454.2676 1458.1232 1460.6428 1461.9173 1469.0386 1475.2200 1477.3375 1483.9790 1494.4768 1515.2038 1581.9314 1582.4655 1607.5444 1614.4262 1621.8043 1622.4288 2961.9195 2963.0259 2971.7389 2973.1242 2978.5698 2979.7761 2986.5435 2990.2724 3008.0144 3015.4088 3029.7342 3032.5977 3038.5489 3043.2686 3057.1654 3076.5647 3131.4558 3132.1478 3142.3784 3143.0737 3164.0527 3164.5287 3189.8244 3190.7056 3476.1074 3483.5000
redmass: 5.0359 5.2056 4.8150 5.2706 4.5483 4.9445 5.4782 4.1238 4.0493 3.7317 2.7631 4.2079 2.8912 3.3154 3.7368 4.2426 3.3645 3.2867 2.6538 3.1266 3.5501 2.8381 3.5091 3.4635 4.3860 2.7193 2.8335 2.3802 3.2895 3.3138 3.0004 3.6453 3.6502 3.8512 3.7889 5.4290 6.2569 5.0283 1.4837 2.0456 2.3224 1.1992 1.5646 3.0041 3.7220 4.3115 2.8399 1.3237 1.4878 1.4746 4.2966 3.7743 2.2810 2.7523 2.9408 1.3467 1.3639 2.1263 2.6152 2.5726 2.4109 1.4049 1.3649 2.0054 7.1120 1.3049 1.3047 1.7956 2.4885 2.1439 1.9788 1.6844 2.1070 2.2748 2.4748 1.4895 1.6122 1.8618 1.3412 1.6336 1.0752 1.0663 1.8288 1.5420 1.4507 1.5088 1.6255 1.5968 1.2972 1.2672 1.6231 1.6687 1.5879 1.8048 1.2910 1.2216 1.5658 1.4817 1.4956 2.0538 1.6677 1.9009 3.8863 1.4500 2.3128 2.5545 1.3187 1.4781 1.8586 1.4759 1.1247 1.0872 1.0892 1.1082 1.0773 1.0974 2.1821 2.5969 5.7392 6.3755 5.9969 6.4469 4.6005 4.8267 1.0608 1.0615 1.0614 1.0614 1.0646 1.0605 1.0663 1.0638 1.0941 1.0981 1.0994 1.1011 1.0997 1.1011 1.1014 1.0962 1.0860 1.0859 1.0915 1.0917 1.0985 1.0986 1.0954 1.0953 1.0762 1.0763
irintensity: 1.0225 1.7824 1.9447 2.2914 2.7275 1.3036 1.2094 2.8714 0.7307 0.9038 1.6361 3.0019 4.7180 6.3844 1.4675 2.6545 0.1524 0.9858 2.4416 2.8819 1.1834 2.2647 0.9476 1.6852 1.4277 0.3516 3.4117 0.5792 23.5134 15.5000 7.7482 2.8386 2.6709 0.8509 0.3981 1.2585 2.6051 0.2619 26.8099 33.1690 2.5754 40.3662 3.1163 2.4887 0.1729 4.1155 1.5798 101.8003 32.9941 48.7973 2.1554 1.4731 5.4719 2.9625 6.0170 6.0033 1.9074 2.2869 4.1614 2.2322 1.6450 6.2575 2.1743 9.1008 9.4900 2.5386 2.1789 3.0679 1.8160 3.4837 9.0135 28.9963 4.8327 1.3217 0.1220 8.0530 9.6515 7.0775 17.7090 51.5987 0.0450 1.8245 21.5898 6.1392 1.9432 8.1155 10.1464 28.5664 9.9187 15.1500 17.6222 18.0828 40.8554 41.2007 9.1871 3.5379 15.3566 2.0092 4.4739 37.2487 15.5033 26.4666 65.6042 1.0996 127.5487 118.2927 53.2785 54.4589 69.7937 34.6625 35.1943 2.7739 14.8363 29.3329 4.4811 3.6914 228.9369 361.4133 108.2513 49.5187 14.4740 0.3805 20.9303 138.0979 8.6858 14.8025 56.7391 32.6679 36.5980 27.7376 19.0065 35.2604 8.6127 17.0384 40.3000 66.0699 14.9229 118.2251 43.9601 20.8199 0.2434 0.0376 27.7806 4.1513 29.6657 18.7446 9.3112 9.3792 45.5011 53.1868
temp: 298.150 k
press: 1.00000 atm
elementType: 8 8 7 7 6 6 6 6 6 6 6 6 6 6 6 6 6 6 6 6 6 6 6 6 6 6 1 1 1 1 1 1 1 1 1 1 1 1 1 1 1 1 1 1 1 1 1 1 1 1 1 1
symmnumber: 1
zpe: 1144317.2 jmol-1
zpe.correction: 0.435847 hartree
zpe.thermalcorrener: 0.459359 hartree
zpe.thermalcorrenthalpy: 0.460303 hartree
zpe.thermalcorrgfe: 0.382892 hartree
zpe.sumelectzpe: -1112.040316 hartree
zpe.sumelectthermal: -1112.016804 hartree
zpe.sumelectthermalent: -1112.015860 hartree
zpe.sumelectthermalfe: -1112.093271 hartree
dipole: -1.5588 0.0683 0.1696
dipole: 1.5695
quadrupole: -146.2456 -175.9675 -139.8937
quadrupole: 0.6357 -0.1940 5.6815
quadrupole: 7.7900 -21.9319 14.1419 0.6357 -0.1940 5.6815
hfenergy: -1112.476163 hartree
pointgroup: C01 [X(C22H26N2O2)]
dipole: -0.6132322 0.0280705 0.0667471 debye
polarizability: 278.6516615|0.5539165|253.2872662|-1.6664098|30.0165286|239.5197169 unknown
InChI: InChI=1S/C22H26N2O2/c25-21-15-5-3-1-2-4-6-16-22(26)24-20-14-10-8-12-18(20)17-11-7-9-13-19(17)23-21/h7-14,23-24H,1-6,15-16H2
charge 0 multiplicity 1
52 atoms
O  1.073405 3.370815 -0.653473
O  1.135043 -3.358012 0.626575
N  -0.283976 1.460207 -0.841628
N  -0.276271 -1.490782 0.841771
C  3.196309 -0.419732 -0.847703
C  3.898893 -1.2167 0.281692
C  3.612133 1.068198 -0.921006
C  3.76824 -0.611896 1.703832
C  3.115057 1.817632 -2.181902
C  2.331666 -0.433709 2.258532
C  1.583192 1.742471 -2.419099
C  1.540359 -1.764119 2.464682
C  0.783248 2.278673 -1.227277
C  0.804652 -2.293231 1.228754
C  -2.188611 0.597861 0.412268
C  -2.172373 -0.643189 -0.438105
C  -1.230539 1.646403 0.202248
C  -1.195817 -1.674165 -0.226142
C  -3.171873 0.767214 1.41671
C  -3.139548 -0.820927 -1.456869
C  -1.261533 2.814902 1.010073
C  -1.191138 -2.831524 -1.051329
C  -3.210478 1.931495 2.216546
C  -3.144542 -1.975673 -2.270764
C  -2.247916 2.94563 2.010082
C  -2.161698 -2.970345 -2.065475
H  2.098218 -0.495148 -0.718568
H  3.424209 -0.914394 -1.814805
H  4.98074 -1.284974 0.044179
H  3.512161 -2.253927 0.281774
H  4.719165 1.135787 -0.89032
H  3.246267 1.60573 -0.024486
H  4.267029 0.377487 1.727836
H  4.333798 -1.255554 2.40884
H  3.617142 1.411122 -3.082509
H  3.400598 2.883025 -2.100585
H  1.756253 0.260715 1.613544
H  2.412496 0.067119 3.243123
H  1.281433 0.707526 -2.66816
H  1.331596 2.369834 -3.297181
H  0.796035 -1.617362 3.273466
H  2.229807 -2.560209 2.793411
H  -0.416463 0.602052 -1.386827
H  -0.445203 -0.653035 1.409048
H  -3.905542 -0.032275 1.56906
H  -3.886126 -0.033704 -1.610212
H  -0.519594 3.596238 0.834901
H  -0.43491 -3.599209 -0.877964
H  -3.978292 2.041859 2.989324
H  -3.900364 -2.092867 -3.054241
H  -2.264695 3.851522 2.626159
H  -2.150145 -3.868159 -2.693402
