program: Gaussian 09
title: 000292991
version: EM64L-G09RevD.01
frameworkgroup: C1[X(C14H2Cl6N2O8)]
method: RPBEPBE
basis: SDD
operation: Freq
keyword: #p
keyword: freq=noraman
keyword: PBEPBE/SDD
title: #p freq=noraman PBEPBE/SDD
converged: YES YES NO NO
title: Mulliken charges:
elementType: Cl Cl Cl Cl Cl Cl O O O O O O O O N N C C C C C C C C C C C C C C H H
charge: 0.060590 0.060588 0.080907 0.080908 0.081864 0.081863 -0.380498 -0.380497 -0.172464 -0.172463 -0.135618 -0.135618 -0.134537 -0.134537 -0.023058 -0.023057 0.590740 0.590743 -0.652122 -0.652127 -0.598800 -0.598791 0.707875 0.707869 0.777998 0.777999 -0.640976 -0.640975 0.037956 0.037955 0.400141 0.400141
chargesum: 0.00000
title: Mulliken charges with hydrogens summed into heavy atoms:
elementType: Cl Cl Cl Cl Cl Cl O O O O O O O O N N C C C C C C C C C C C C C C
charge: 0.060590 0.060588 0.080907 0.080908 0.081864 0.081863 0.019643 0.019644 -0.172464 -0.172463 -0.135618 -0.135618 -0.134537 -0.134537 -0.023058 -0.023057 0.590740 0.590743 -0.652122 -0.652127 -0.598800 -0.598791 0.707875 0.707869 0.777998 0.777999 -0.640976 -0.640975 0.037956 0.037955
polarizability: 3.34224919e+02 -3.19288291e-03 2.30105441e+02 1.85333618e-01 -1.13497931e-03 2.34235277e+02
1716.lowfreq: -3.6836 -0.0008 -0.0004 0.0025 3.5457 3.6139 8.6390 8.6824 14.4064
frequency: 7.6564 8.2496 14.3961 17.7454 18.6573 28.3367 29.0335 55.7468 58.7894 60.4059 61.2243 88.4251 88.8829 102.0504 126.3590 137.4117 138.3349 146.2000 151.4800 151.9149 180.5173 180.6374 191.8211 198.2098 201.4787 226.2927 282.1545 282.2412 286.5173 286.6549 332.7320 333.3821 353.9364 354.4680 427.8142 432.5473 452.2270 456.5304 466.8488 474.6401 477.2261 545.7667 547.9056 559.6521 607.6141 632.3047 634.1087 642.0724 674.6044 675.9804 679.5562 697.1436 699.7799 719.7545 736.4223 736.6150 754.9910 762.4357 788.1509 794.9866 798.2037 887.5821 888.5126 935.5999 1025.5359 1054.5270 1087.8749 1101.5453 1181.0187 1222.6792 1230.0759 1251.8182 1287.1740 1308.4981 1329.4690 1344.8028 1345.3726 1372.7110 1380.2116 1403.5020 1403.7287 1426.4655 1548.2463 1552.9381 1573.9327 1587.9550 1659.5112 1659.5319 3502.3135 3502.3743
redmass: 15.5648 16.0033 14.7244 9.8184 10.6793 19.3742 21.0717 16.3186 14.6318 17.8652 21.5016 22.8406 23.5431 12.5170 10.1172 14.3481 13.9227 16.0572 17.4701 21.5171 25.3436 25.2353 22.8397 12.3829 13.2787 20.9913 17.4898 17.3775 16.3873 15.4970 12.8560 12.4689 32.7073 32.2670 10.6377 11.2931 12.5410 11.5726 7.5357 6.5215 7.9328 5.6613 7.5302 4.2525 1.5783 5.7415 1.9122 6.7684 10.4724 8.3676 6.6490 8.3126 8.0272 11.1658 13.9603 13.6786 11.9532 11.9948 12.2666 12.0041 12.0851 12.1717 12.2766 12.5730 5.2074 3.1776 4.4985 7.3066 5.0185 12.1704 10.1111 2.8463 3.1110 6.8841 11.8878 10.6169 10.9848 9.2549 9.9172 14.6330 14.6431 12.0135 12.0046 12.0084 12.0153 12.0077 10.5329 10.5256 1.0640 1.0641
irintensity: 0.1308 0.0019 0.1158 0.8326 2.8874 0.1634 0.3135 1.1502 0.1089 0.0998 0.4980 0.1939 0.1794 0.1815 0.3817 1.8184 0.1367 0.0002 1.4318 0.3058 0.1003 0.0009 1.4487 0.1583 2.4725 0.0146 0.3145 1.1127 0.2726 0.6013 0.0503 0.0786 0.0886 0.0399 0.0863 0.9472 2.7823 1.1554 29.4426 0.9477 36.1783 104.0402 28.0623 5.3226 219.1009 41.4086 44.9339 0.9986 0.7933 5.8509 6.9314 0.8182 24.5740 2.9968 0.0129 0.0331 0.7027 1.3273 102.9808 3.9994 0.1646 6.6817 46.4158 32.4471 59.8830 421.1187 57.6185 70.1360 4.4904 76.5243 190.9065 34.2051 110.8211 58.2006 95.1504 0.9071 5.1178 4.3420 15.5013 141.3526 146.4864 0.0139 48.2006 80.1234 120.2263 13.6139 34.0767 407.8707 32.9627 75.6042
temp: 298.150 k
press: 1.00000 atm
elementType: 17 17 17 17 17 17 8 8 8 8 8 8 8 8 7 7 6 6 6 6 6 6 6 6 6 6 6 6 6 6 1 1
symmnumber: 1
zpe: 383485.3 jmol-1
zpe.correction: 0.146062 hartree
zpe.thermalcorrener: 0.176042 hartree
zpe.thermalcorrenthalpy: 0.176986 hartree
zpe.thermalcorrgfe: 0.075188 hartree
zpe.sumelectzpe: -4004.007039 hartree
zpe.sumelectthermal: -4003.977059 hartree
zpe.sumelectthermalent: -4003.976115 hartree
zpe.sumelectthermalfe: -4004.077913 hartree
dipole: 0.0000 5.7845 0.0010
dipole: 5.7845
quadrupole: -208.5426 -203.7561 -232.2712
quadrupole: 0.0031 -14.0154 0.0040
quadrupole: 6.3140 11.1005 -17.4146 0.0031 -14.0154 0.0040
hfenergy: -4004.1531005 hartree
pointgroup: C01 [X(C14H2Cl6N2O8)]
dipole: 0.0000753 -2.2757836 -0.0001789 debye
polarizability: 334.1860799|0.0072566|230.1054409|-1.9789672|-0.0008996|234.2741158 unknown
InChI: InChI=1S/C14H2Cl6N2O8/c15-5-1(7(17)11(21(27)28)9(19)3(5)13(23)24)2-6(16)4(14(25)26)10(20)12(8(2)18)22(29)30/h23,25H
charge 0 multiplicity 1
32 atoms
Cl 0.623892 -1.944419 1.947646
Cl -0.623864 -1.944211 -1.947974
Cl 0.563159 1.981676 -1.982017
Cl -0.563203 1.98131 1.982262
Cl 5.391954 0.011522 -0.113511
Cl -5.39196 0.011176 0.113627
O  4.082549 -2.915017 1.131123
O  -4.082407 -2.915084 -1.131457
O  3.925302 -1.483156 2.962798
O  -3.925454 -1.482942 -2.962938
O  3.865392 1.303282 -3.016282
O  -3.865641 1.302414 3.016383
O  3.902002 2.932673 -1.406974
O  -3.901791 2.932397 1.407659
N  3.599662 1.766787 -1.849516
N  -3.599691 1.766302 1.849819
C  0.74668 0.018773 -0.014304
C  -0.746688 0.018755 0.014199
C  1.502669 -0.833931 0.826156
C  -1.502661 -0.833869 -0.826355
C  1.462295 0.869892 -0.888666
C  -1.462318 0.869726 0.888693
C  2.914357 -0.860465 0.819703
C  -2.91435 -0.86048 -0.819855
C  2.869006 0.860798 -0.916283
C  -2.869028 0.860551 0.916361
C  3.591188 -0.000288 -0.069711
C  -3.591195 -0.000453 0.069693
C  3.681791 -1.749151 1.771652
C  -3.681769 -1.749111 -1.771867
H  4.599351 -3.492224 1.7586
H  -4.599232 -3.492236 -1.758965
