program: Gaussian 09
title: 000295421
version: EM64L-G09RevD.01
frameworkgroup: C1[X(C15H23NO3)]
method: RPBEPBE
basis: SDD
operation: Freq
keyword: #p
keyword: freq=noraman
keyword: PBEPBE/SDD
title: #p freq=noraman PBEPBE/SDD
converged: YES YES NO NO
title: Mulliken charges:
elementType: O O O N C C C C C C C C C C C C C C C H H H H H H H H H H H H H H H H H H H H H H H
charge: -0.275669 -0.445619 -0.317486 -0.124906 -0.031148 -0.459697 -0.379476 -0.467620 -0.294594 -0.375442 -0.139718 -0.627464 -0.317984 0.394072 -0.346923 -0.389057 -0.222268 -0.197171 -0.256817 0.218391 0.239673 0.214498 0.215826 0.211905 0.231089 0.223762 0.191806 0.220705 0.219166 0.221431 0.221335 0.226398 0.202463 0.220097 0.231988 0.232636 0.351014 0.251577 0.246660 0.224852 0.228387 0.229326
chargesum: 0.00000
title: Mulliken charges with hydrogens summed into heavy atoms:
elementType: O O O N C C C C C C C C C C C C C C C
charge: -0.275669 -0.094606 -0.317486 -0.124906 0.187243 -0.005526 0.048255 -0.012769 0.117918 0.065155 0.081617 0.021494 0.146640 0.394072 -0.095346 -0.142397 0.002584 0.031216 -0.027491
polarizability: 1.76806156e+02 -3.05182322e+01 1.85634020e+02 -4.11586518e+00 7.96289007e-01 1.56183926e+02
1716.lowfreq: -28.5130 -5.7210 -4.4943 0.0003 0.0005 0.0007 6.5368 13.3308 28.1299
frequency: -25.3315 10.8610 27.9401 38.3236 40.2858 62.7549 90.6638 110.9502 138.1457 152.0934 171.4483 194.3908 207.0389 232.6254 237.5653 265.3412 328.0630 339.4226 393.9729 402.8164 408.6260 413.0066 423.7797 452.3765 502.3683 509.4912 537.5738 584.1290 609.6161 637.9525 677.3097 691.3314 757.7288 800.0652 813.8075 822.2789 823.1483 840.1692 853.7605 862.3565 887.4235 889.0399 913.2078 917.0492 943.7545 961.8356 973.7233 982.5222 983.0381 988.3772 999.8466 1022.2093 1026.8642 1032.0703 1067.6134 1068.4659 1082.7825 1103.2371 1104.3693 1114.0095 1135.5993 1152.3965 1165.8256 1167.7717 1177.9416 1191.9154 1216.3364 1222.3205 1226.2229 1239.1294 1250.6674 1279.4599 1283.8408 1297.8744 1308.3984 1312.3145 1321.7927 1330.3350 1339.0508 1349.0208 1356.9595 1377.8100 1388.5453 1391.4390 1437.7624 1442.6361 1450.1110 1455.2139 1465.8151 1470.5406 1474.8912 1476.8130 1479.1249 1481.2703 1488.3207 1592.7457 1611.3308 2877.7438 2901.0877 2913.7832 2960.9809 2980.8698 2997.4630 3012.2851 3017.2874 3032.8432 3039.5005 3043.5789 3052.6738 3058.5579 3063.8044 3076.6294 3085.4907 3090.7200 3129.1063 3137.4310 3155.4212 3164.0572 3173.2220 3532.6738
redmass: 3.4575 5.2808 3.5907 4.7463 3.2931 3.6643 3.2481 4.4944 3.4552 2.2642 1.8575 2.0122 2.8676 4.2885 2.4393 4.6919 2.9597 2.9974 2.6922 1.8703 2.3344 2.6677 1.3476 2.6439 2.8857 4.5714 3.6984 1.9941 6.4488 4.1770 5.0608 2.1092 1.6238 4.5402 2.5452 2.7151 1.3712 2.9636 2.5544 2.4124 1.8783 1.4698 2.4420 2.4745 3.3014 1.3706 1.8374 1.6086 2.5423 2.6330 2.0866 2.0611 3.7004 1.9478 1.6298 1.8781 1.5304 1.8292 1.7621 1.4664 1.2978 1.5990 1.7147 1.0888 1.1683 1.6155 2.6637 1.4128 1.5539 1.3706 1.3401 1.6318 1.4084 1.4354 1.2627 1.3331 1.3727 1.3367 1.3157 1.3462 1.3919 1.3591 4.9681 1.3766 1.1607 2.0631 1.2018 1.0794 1.0864 1.0962 1.0536 1.1094 1.0953 1.8857 1.0971 6.4638 6.2371 1.0556 1.0685 1.0688 1.0673 1.0549 1.0787 1.0608 1.0717 1.0753 1.0877 1.0897 1.1072 1.0910 1.0971 1.1008 1.1004 1.1052 1.0848 1.0889 1.0927 1.0954 1.1005 1.0653
irintensity: 0.9767 0.1435 0.6207 1.3683 0.2633 3.2994 0.6438 1.4348 4.5058 0.5144 5.6600 0.4795 1.4089 2.2011 5.2183 1.1045 1.6490 4.7248 30.2561 7.9841 0.8159 0.3814 104.7581 52.5446 11.4710 9.2378 2.7579 5.5666 0.7301 2.9027 6.7953 32.4379 94.7746 5.0950 21.0205 16.0637 2.3788 13.6438 2.1606 8.0083 3.9548 7.5023 16.7650 19.8880 59.3973 0.5500 20.9816 1.3236 4.1649 4.5704 56.3083 14.0431 64.1779 76.1988 1.1121 51.5388 13.9543 19.1992 10.5046 3.5085 1.1702 23.4159 4.9908 11.4616 40.3045 7.1286 205.8297 12.9471 29.0006 9.3829 2.4396 6.0086 5.7068 7.0518 2.2538 1.4774 6.8574 3.2027 4.5798 1.5007 0.3075 33.7534 7.7786 20.1244 8.3308 7.0427 73.6210 0.6048 6.7244 22.5307 7.4218 13.2314 22.0612 59.5971 1.5262 22.2065 75.1443 109.2190 44.7785 131.7363 99.3836 23.6301 19.6715 26.0167 24.3204 30.2947 27.9055 11.9347 26.7652 69.9429 32.9879 15.0209 31.9517 63.2281 2.6790 10.8230 27.7431 22.7401 4.8882 13.4385
temp: 298.150 k
press: 1.00000 atm
elementType: 8 8 8 7 6 6 6 6 6 6 6 6 6 6 6 6 6 6 6 1 1 1 1 1 1 1 1 1 1 1 1 1 1 1 1 1 1 1 1 1 1 1
symmnumber: 1
zpe: 938074.3 jmol-1
zpe.correction: 0.357294 hartree
zpe.thermalcorrener: 0.376020 hartree
zpe.thermalcorrenthalpy: 0.376964 hartree
zpe.thermalcorrgfe: 0.307514 hartree
zpe.sumelectzpe: -864.284810 hartree
zpe.sumelectthermal: -864.266084 hartree
zpe.sumelectthermalent: -864.265140 hartree
zpe.sumelectthermalfe: -864.334590 hartree
dipole: 1.0698 -2.0250 1.4769
dipole: 2.7251
quadrupole: -123.9778 -120.1722 -106.4631
quadrupole: -10.1891 -3.7809 2.5713
quadrupole: -7.1068 -3.3011 10.4080 -10.1891 -3.7809 2.5713
hfenergy: -864.642104 hartree
pointgroup: C01 [X(C15H23N1O3)]
dipole: -0.1823263 0.8979924 0.5566133 debye
polarizability: 159.874903|-22.332346|202.1731342|4.2784337|-3.7146027|156.5760654 unknown
InChI: InChI=1S/C15H23NO3/c1-16(11-15-8-5-9-18-15)10-13(17)12-19-14-6-3-2-4-7-14/h2-4,6-7,13,15,17H,5,8-12H2,1H3
charge 0 multiplicity 1
42 atoms
O  4.369391 0.586139 -0.22353
O  -1.790239 -3.374841 -0.61738
O  -1.779251 -0.595728 -0.376406
N  1.606713 -1.943119 0.292804
C  3.235666 -0.033439 0.527754
C  2.292549 1.12908 0.924619
C  2.585062 -1.074503 -0.411796
C  2.60827 2.227862 -0.125046
C  4.12465 2.045647 -0.330794
C  0.515204 -2.463271 -0.566708
C  -0.796574 -2.695977 0.227283
C  2.267023 -3.015131 1.071192
C  -1.368719 -1.394227 0.798814
C  -2.333558 0.677129 -0.158418
C  -2.513794 1.255297 1.122491
C  -2.715131 1.384772 -1.325429
C  -3.080095 2.548067 1.222072
C  -3.27744 2.671195 -1.208161
C  -3.463784 3.262329 0.066175
H  3.664905 -0.534213 1.416246
H  1.23809 0.805749 0.913286
H  2.532209 1.494226 1.940183
H  3.403973 -1.6611 -0.892157
H  2.060743 -0.529229 -1.217871
H  2.344311 3.240096 0.225524
H  2.062202 2.035337 -1.066372
H  4.700333 2.575886 0.456684
H  4.487637 2.365078 -1.322607
H  0.780597 -3.425488 -1.064428
H  0.305074 -1.724333 -1.361179
H  -0.617333 -3.395306 1.063211
H  2.996522 -2.583212 1.777418
H  2.807849 -3.744247 0.41857
H  1.52359 -3.575523 1.66448
H  -0.585705 -0.863294 1.373284
H  -2.254063 -1.598045 1.431715
H  -2.167248 -2.688362 -1.228235
H  -2.224966 0.718632 2.030714
H  -2.565489 0.913965 -2.302288
H  -3.220481 2.993663 2.213436
H  -3.572076 3.213707 -2.113408
H  -3.902121 4.261832 0.153457
