program: Gaussian 09
title: 000292960
version: EM64L-G09RevD.01
frameworkgroup: C1[X(C10H10N2O6)]
method: RPBEPBE
basis: SDD
operation: Freq
keyword: #p
keyword: freq=noraman
keyword: PBEPBE/SDD
title: #p freq=noraman PBEPBE/SDD
converged: YES YES NO NO
title: Mulliken charges:
elementType: O O O O O O N N C C C C C C C C C C H H H H H H H H H H
charge: -0.397836 -0.207781 -0.169588 -0.167117 -0.171068 -0.172495 -0.008706 -0.016463 0.179625 0.129872 0.176574 0.147323 0.165611 0.147005 -0.794776 -0.791709 -0.781894 -0.005429 0.248649 0.276943 0.255619 0.247571 0.273610 0.264309 0.249599 0.277845 0.255632 0.389074
chargesum: 0.00000
title: Mulliken charges with hydrogens summed into heavy atoms:
elementType: O O O O O O N N C C C C C C C C C C
charge: -0.008762 -0.207781 -0.169588 -0.167117 -0.171068 -0.172495 -0.008706 -0.016463 0.179625 0.129872 0.176574 0.147323 0.165611 0.147005 -0.013565 -0.006219 0.001183 -0.005429
polarizability: 1.76981421e+02 -1.93355433e-01 1.77647268e+02 7.78284962e-01 -2.54634260e+00 1.00809252e+02
1716.lowfreq: -8.8079 -3.3556 -0.0003 0.0001 0.0009 6.3761 41.0724 48.9173 64.7185
frequency: 41.0669 48.9110 64.7115 70.6822 77.6319 78.2814 109.2896 115.9756 117.0682 157.6997 165.4480 167.4802 231.5746 237.9550 261.5588 301.1234 307.3814 313.2701 368.9191 371.8120 409.2759 454.7516 459.4234 531.9272 561.7547 564.5739 571.6911 610.6632 636.9278 659.7501 698.6303 720.8433 722.4300 741.7977 775.3930 803.5885 821.9915 984.9989 1005.3603 1034.2141 1043.1426 1044.5058 1045.5049 1050.6487 1061.3604 1084.6590 1159.3990 1230.2244 1242.6447 1291.3318 1310.9718 1350.2654 1365.3653 1370.9767 1387.5601 1402.7983 1407.6903 1411.3408 1423.2499 1460.5865 1461.4399 1465.1106 1491.1092 1493.4519 1497.3184 1564.8399 1587.2153 1645.2539 3004.0136 3006.9368 3008.8227 3078.7056 3083.8273 3085.3848 3136.9494 3141.0860 3141.7152 3492.9978
redmass: 8.4606 7.6182 4.0247 4.8792 5.7086 4.1256 1.1306 1.1520 1.1283 8.3535 11.9529 3.0729 6.7629 7.6985 5.0432 13.1059 5.0459 5.1379 3.3983 3.2865 5.6205 5.0278 4.9665 3.5916 4.2986 4.1682 3.8529 6.2822 2.1580 4.0047 7.6787 9.5981 9.1841 4.6186 5.1067 5.5427 6.3114 4.2643 5.3337 1.8038 1.5862 1.6070 1.5479 1.8564 2.3636 1.6639 3.2878 14.3231 7.1879 3.3937 8.0902 6.8072 6.9606 8.8294 5.7576 1.5598 1.2070 1.2006 2.1294 1.1391 1.1320 1.2137 1.1234 1.0820 1.0953 5.6841 8.2874 9.1401 1.0403 1.0398 1.0398 1.0973 1.0969 1.0972 1.0977 1.0977 1.0965 1.0639
irintensity: 1.9564 0.7198 1.0684 0.2470 1.4308 0.7868 1.4421 2.5751 1.5616 0.9642 4.4746 2.8560 2.1253 0.0850 1.7987 0.5468 6.5566 6.4951 0.7033 0.4891 1.2087 7.0248 5.0261 9.6381 26.4071 6.5194 21.3942 18.1776 132.1432 12.3689 0.5961 3.5996 1.1275 10.5138 2.1088 5.3268 25.8494 105.8391 1.9254 46.9193 4.8018 24.0945 0.8903 4.1051 104.2477 6.0347 52.6270 217.1851 70.9839 17.5408 4.0964 7.3990 81.6147 163.2551 98.3621 13.1046 47.4276 6.9226 19.8751 10.8040 23.6205 10.8152 7.4197 26.1092 21.3453 23.3319 27.0787 232.7052 3.3906 2.6577 2.5284 4.7750 6.3676 3.8763 4.1274 3.6544 8.5016 39.8957
temp: 298.150 k
press: 1.00000 atm
elementType: 8 8 8 8 8 8 7 7 6 6 6 6 6 6 6 6 6 6 1 1 1 1 1 1 1 1 1 1
symmnumber: 1
zpe: 513845.3 jmol-1
zpe.correction: 0.195713 hartree
zpe.thermalcorrener: 0.213870 hartree
zpe.thermalcorrenthalpy: 0.214814 hartree
zpe.thermalcorrgfe: 0.148505 hartree
zpe.sumelectzpe: -946.423155 hartree
zpe.sumelectthermal: -946.404999 hartree
zpe.sumelectthermalent: -946.404055 hartree
zpe.sumelectthermalfe: -946.470363 hartree
dipole: -3.4067 -0.0035 1.0262
dipole: 3.5579
quadrupole: -96.0449 -118.9505 -111.2646
quadrupole: 0.1173 -6.4839 -1.1774
quadrupole: 12.7084 -10.1972 -2.5112 0.1173 -6.4839 -1.1774
hfenergy: -946.6188688 hartree
pointgroup: C01 [X(C10H10N2O6)]
dipole: -1.3168113 -0.1924958 -0.4340126 debye
polarizability: 176.9291191|0.0850655|177.7758555|0.8897716|0.647327|100.7329662 unknown
InChI: InChI=1S/C10H10N2O6/c1-4-7(10(13)14)5(2)9(12(17)18)6(3)8(4)11(15)16/h13H,1-3H3
charge 0 multiplicity 1
28 atoms
O  -3.472172 -0.45953 -1.163673
O  -3.63797 0.488486 0.945459
O  1.217083 3.35929 -0.824377
O  1.243459 -3.295466 0.858533
O  2.284166 2.659198 1.065539
O  2.145269 -2.710829 -1.153827
N  1.446913 2.490468 0.099849
N  1.407512 -2.476465 -0.122419
C  -0.731734 -1.219996 -0.057869
C  -0.719799 1.269818 0.057341
C  1.455329 0.011911 -0.015514
C  -1.416947 0.026504 -0.006635
C  0.695798 1.207129 0.04725
C  0.687302 -1.174344 -0.063488
C  -1.457254 -2.551874 -0.069932
C  -1.443905 2.601894 0.107346
C  2.97072 0.025495 -0.002143
C  -2.921762 0.051156 0.018601
H  -1.03645 -3.233256 -0.83049
H  -1.342517 -3.054519 0.906679
H  -2.526481 -2.43223 -0.287231
H  -0.951475 3.305599 0.79985
H  -1.430539 3.079242 -0.888693
H  -2.485242 2.484168 0.435785
H  3.366086 0.77636 -0.708495
H  3.337527 0.307201 0.999924
H  3.39437 -0.948031 -0.281957
H  -4.467184 -0.41758 -1.107814
