program: Gaussian 09
title: 000292963
version: EM64L-G09RevD.01
frameworkgroup: C1[X(C16H18F2N2)]
method: RPBEPBE
basis: SDD
operation: Freq
keyword: #p
keyword: freq=noraman
keyword: PBEPBE/SDD
title: #p freq=noraman PBEPBE/SDD
converged: YES YES NO NO
title: Mulliken charges:
elementType: F F N N C C C C C C C C C C C C C C C C H H H H H H H H H H H H H H H H H H
charge: -0.188023 -0.188028 -0.674454 -0.674359 -0.073113 -0.073106 0.217487 0.217452 0.347449 0.347416 0.089445 0.089426 0.297697 0.297718 -0.608830 -0.608830 -0.864612 -0.864610 -0.803044 -0.803045 0.234885 0.234896 0.226827 0.238081 0.224096 0.224347 0.226558 0.238091 0.241166 0.233916 0.214910 0.214896 0.241130 0.233969 0.316172 0.329954 0.316143 0.329930
chargesum: 0.00000
title: Mulliken charges with hydrogens summed into heavy atoms:
elementType: F F N N C C C C C C C C C C C C C C C C
charge: -0.188023 -0.188028 -0.028328 -0.028287 -0.073113 -0.073106 0.217487 0.217452 0.347449 0.347416 0.089445 0.089426 0.297697 0.297718 -0.373944 -0.373934 -0.175609 -0.175614 -0.113052 -0.113051
polarizability: 2.42627725e+02 -1.28203234e-02 1.69163280e+02 -4.39693544e+00 -1.63520608e-03 1.68246715e+02
1716.lowfreq: -10.5194 -0.0008 -0.0005 0.0005 3.7975 4.7528 8.4514 51.5197 52.0841
frequency: -10.4509 51.5160 52.0814 102.9928 104.9654 115.2753 115.9916 131.3406 133.6943 183.2592 185.0739 188.3806 198.0776 198.3272 254.3657 255.5654 285.1013 297.2749 297.4980 315.4626 325.5181 351.4730 352.0084 359.8363 366.8675 377.2286 432.7435 433.4868 445.8026 490.1324 491.2032 507.3678 526.1309 527.8685 608.5643 608.8144 637.3737 639.6571 668.1776 681.2335 736.4733 764.7735 765.2802 863.3091 873.8666 884.9884 885.1437 925.1216 980.9823 1006.6202 1015.5284 1020.1433 1041.3777 1041.4351 1048.6835 1048.7483 1061.8470 1078.2821 1088.0898 1131.4288 1196.7302 1232.5557 1259.0853 1297.8151 1340.9938 1357.2241 1373.3614 1380.8600 1398.6174 1398.7212 1401.5795 1403.6725 1412.3869 1443.6623 1463.3523 1463.4353 1465.3054 1466.6757 1473.3446 1473.3743 1485.0732 1488.5399 1496.5134 1501.2229 1588.5802 1593.3468 1610.3995 1618.7018 1638.5651 1643.2360 2949.3983 2949.5850 2979.9908 2980.1822 3015.8874 3015.9189 3057.1533 3057.2115 3081.8212 3081.8751 3086.5489 3086.6042 3120.4988 3120.5901 3550.4476 3552.4313 3699.7878 3699.9761
redmass: 4.8943 4.4131 4.5100 1.1409 1.1827 2.6861 2.6866 5.1894 5.2753 3.2597 2.5789 3.5141 1.1555 1.1704 2.9115 3.1978 1.2249 2.4208 3.0933 1.5346 4.1876 3.9960 3.4184 4.5692 3.1158 4.6785 5.7998 6.0025 1.1390 6.1556 1.1585 5.1563 3.6786 3.2581 3.3766 3.3904 6.3356 6.3850 5.0221 5.4102 7.6202 5.9988 6.0716 3.2741 3.7419 1.3075 1.3171 3.2139 1.4732 1.5786 1.5592 1.6433 1.4814 1.4819 1.4979 1.4974 2.3300 4.6942 2.9651 2.0482 3.0254 1.7886 1.6990 2.9681 6.3274 5.8008 3.8771 4.7777 1.3899 1.3921 1.3538 1.2495 3.2162 2.7758 1.0449 1.0451 1.6909 1.6495 1.0472 1.0480 1.2236 1.4302 1.8567 1.8161 7.0565 5.2982 1.3462 1.3763 4.1129 5.6869 1.0395 1.0395 1.0367 1.0367 1.0976 1.0976 1.0977 1.0977 1.0952 1.0952 1.0994 1.0994 1.0913 1.0913 1.0455 1.0459 1.1025 1.1025
irintensity: 0.8518 1.2761 1.2675 0.9483 1.0662 0.7719 1.2264 0.6815 0.1630 0.5788 2.6651 1.2040 0.4139 0.5562 5.0588 0.0320 92.7625 16.5771 4.4751 106.9670 8.7134 7.5543 7.2797 7.8054 59.4396 2.4595 3.4899 1.8235 20.8905 13.0981 63.2260 1.4119 8.4436 1.7582 0.9795 5.3090 0.0323 0.0727 5.4975 1.7895 3.4573 4.5848 3.1175 6.3583 21.4238 12.0758 15.4673 14.4791 1.7138 18.5081 20.2634 2.0174 0.4033 0.4941 7.3667 9.2607 97.2854 63.9512 20.3110 0.1559 27.6915 6.3950 2.8984 0.0890 25.6047 2.7795 25.6927 0.0020 16.0834 28.3019 8.9476 2.3114 1.2009 4.0629 10.5061 10.2182 48.6372 46.1708 14.2110 17.8055 40.5158 50.7775 105.5284 25.3541 43.0421 0.1357 77.8546 82.3644 188.8674 76.0205 64.7089 40.8711 65.4659 30.5030 24.6660 26.9625 19.0506 18.3222 22.0807 10.3166 23.3518 14.5028 43.4566 0.0966 25.2336 90.1885 54.4732 25.1449
temp: 298.150 k
press: 1.00000 atm
elementType: 9 9 7 7 6 6 6 6 6 6 6 6 6 6 6 6 6 6 6 6 1 1 1 1 1 1 1 1 1 1 1 1 1 1 1 1 1 1
symmnumber: 1
zpe: 795592.6 jmol-1
zpe.correction: 0.303025 hartree
zpe.thermalcorrener: 0.323283 hartree
zpe.thermalcorrenthalpy: 0.324228 hartree
zpe.thermalcorrgfe: 0.256307 hartree
zpe.sumelectzpe: -928.271553 hartree
zpe.sumelectthermal: -928.251295 hartree
zpe.sumelectthermalent: -928.250350 hartree
zpe.sumelectthermalfe: -928.318271 hartree
dipole: -0.0003 4.3823 -0.0007
dipole: 4.3823
quadrupole: -100.7287 -113.9725 -111.5871
quadrupole: -0.0052 2.2347 -0.0005
quadrupole: 8.0341 -5.2097 -2.8243 -0.0052 2.2347 -0.0005
hfenergy: -928.574578 hartree
pointgroup: C01 [X(C16H18F2N2)]
dipole: -0.0000614 -0.0326757 1.7238312 debye
polarizability: 242.572194|4.8430075|168.3025077|0.0764942|-0.0151119|169.1630177 unknown
InChI: InChI=1S/C16H18F2N2/c1-7-5-9(3)15(19)11(13(7)17)12-14(18)8(2)6-10(4)16(12)20/h5-6H,19-20H2,1-4H3
charge 0 multiplicity 1
38 atoms
F  -0.754048 -1.669841 -1.724359
F  0.75439 1.733072 -1.661337
N  -0.795399 1.68271 1.782522
N  0.795328 -1.746675 1.71958
C  -0.747727 -0.003429 0.021201
C  0.747755 0.003378 0.021518
C  -1.486005 0.847482 0.906252
C  1.485877 -0.879561 0.874805
C  -2.917856 0.825638 0.892302
C  2.917725 -0.857651 0.861391
C  -1.485441 -0.831154 -0.846171
C  1.485654 0.862224 -0.814891
C  -2.891242 -0.891868 -0.909812
C  2.89147 0.924969 -0.876296
C  -3.576568 -0.036894 -0.009974
C  3.576635 0.037305 -0.008575
C  -3.699397 1.727416 1.829373
C  3.698943 -1.793814 1.764359
C  -3.605197 -1.80534 -1.884699
C  3.605602 1.873416 -1.817063
H  -4.673659 -0.045096 -0.019956
H  4.673727 0.045572 -0.018322
H  -3.47977 2.800052 1.649967
H  -4.785581 1.592714 1.694267
H  -3.471764 1.517547 2.894392
H  3.473797 -1.62123 2.836571
H  3.476288 -2.858887 1.547543
H  4.785189 -1.657074 1.631856
H  -3.346065 -1.561494 -2.931581
H  -3.330029 -2.864994 -1.729462
H  -4.699291 -1.715266 -1.773241
H  4.699635 1.782337 -1.705797
H  3.350024 1.665138 -2.872491
H  3.327114 2.926335 -1.626161
H  -1.288926 2.337686 2.379544
H  0.220393 1.723139 1.73909
H  1.288947 -2.42486 2.290058
H  -0.220527 -1.784704 1.675498
