program: Gaussian 09
title: 000292952
version: EM64L-G09RevD.01
frameworkgroup: C1[X(C12H11NO2)]
method: RPBEPBE
basis: SDD
operation: Freq
keyword: #p
keyword: freq=noraman
keyword: PBEPBE/SDD
title: #p freq=noraman PBEPBE/SDD
converged: YES YES NO NO
title: Mulliken charges:
elementType: O O N C C C C C C C C C C C C H H H H H H H H H H H
charge: -0.411726 -0.235768 -0.030927 0.285269 0.219732 0.147972 -0.095868 0.002851 -0.361967 -0.794052 -0.317675 -0.785330 -0.255107 0.046296 -0.230082 0.268842 0.249055 0.245050 0.225936 0.264875 0.260063 0.226277 0.230384 0.230011 0.233382 0.382507
chargesum: 0.00000
title: Mulliken charges with hydrogens summed into heavy atoms:
elementType: O O N C C C C C C C C C C C C
charge: -0.029219 -0.235768 -0.030927 0.285269 0.219732 0.147972 -0.095868 0.002851 -0.093124 -0.074011 -0.052801 -0.068607 -0.025096 0.046296 0.003301
polarizability: 2.08681500e+02 1.23581037e+01 1.63247299e+02 8.77678671e-01 1.76718539e+00 7.03887388e+01
1716.lowfreq: -9.9688 -5.8294 -0.0003 -0.0002 0.0005 9.3965 44.8718 78.5508 87.5643
frequency: 44.5874 78.5449 87.4719 97.9023 131.2983 177.0463 191.4213 258.6960 267.1885 303.6390 338.3150 363.3806 372.9057 438.2350 445.7333 460.0160 497.5434 535.7266 591.3480 595.3487 628.1734 645.8037 667.2314 681.9015 727.7310 778.4333 799.2850 819.7143 851.7991 884.1354 930.9498 969.2820 997.4252 1004.8507 1016.7912 1027.1181 1037.0761 1052.3461 1075.8171 1108.4856 1152.2939 1184.6439 1246.4021 1251.9350 1295.9040 1316.7783 1364.0113 1379.8818 1390.5712 1406.4806 1416.4047 1438.0276 1455.6042 1459.6269 1471.7781 1474.9847 1495.9104 1554.6143 1568.8230 1618.5018 1636.0420 2978.2235 2989.0165 3054.8287 3067.3310 3119.7605 3124.1096 3133.5616 3150.2098 3169.5173 3178.5539 3495.7709
redmass: 3.5638 4.3157 1.4504 2.9583 3.5681 1.1110 4.7013 4.7443 3.6917 3.6239 3.8923 3.3904 5.8942 4.5380 4.1063 4.7499 3.2681 3.3435 3.0603 4.2040 1.6333 5.4309 5.3202 3.4385 4.2962 1.4675 3.2621 5.2307 3.8379 1.6720 7.7028 1.3675 1.3317 1.6886 1.6940 1.9576 2.0024 1.6943 2.0912 2.2542 1.5398 1.3594 2.7076 2.1765 2.0580 3.6701 7.1971 3.3461 1.2929 1.1879 5.1546 1.6906 1.1534 1.5671 1.2088 1.0946 2.0593 7.0075 7.0387 6.1735 8.7298 1.0395 1.0417 1.0959 1.0944 1.0978 1.0967 1.0863 1.0907 1.0963 1.0973 1.0638
irintensity: 1.2169 0.5686 2.0244 0.0346 4.5459 0.0757 1.4148 0.3062 3.7671 1.3199 0.8570 1.5486 1.7707 2.1414 3.9355 3.1935 3.1574 0.6637 44.5689 39.6509 97.6784 2.0819 9.8885 12.6046 4.5415 87.6863 1.4245 1.7664 7.3377 1.6834 54.2916 1.6653 0.8852 23.2132 21.7238 14.8357 53.6811 0.6359 180.2325 0.3561 28.3824 10.5775 15.8349 5.8241 18.1573 30.9081 30.7576 24.2244 21.5157 17.3647 4.7978 18.4816 4.1964 3.7909 12.3333 28.4687 31.9024 12.5855 30.3510 1.3655 198.3622 21.7876 19.7860 20.6443 14.9923 12.9850 8.7057 5.2488 14.1662 13.0936 16.4169 33.1954
temp: 298.150 k
press: 1.00000 atm
elementType: 8 8 7 6 6 6 6 6 6 6 6 6 6 6 6 1 1 1 1 1 1 1 1 1 1 1
symmnumber: 1
zpe: 526481.3 jmol-1
zpe.correction: 0.200526 hartree
zpe.thermalcorrener: 0.213793 hartree
zpe.thermalcorrenthalpy: 0.214737 hartree
zpe.thermalcorrgfe: 0.160546 hartree
zpe.sumelectzpe: -668.036303 hartree
zpe.sumelectthermal: -668.023036 hartree
zpe.sumelectthermalent: -668.022091 hartree
zpe.sumelectthermalfe: -668.076283 hartree
dipole: 1.7717 -0.3586 0.8353
dipole: 1.9913
quadrupole: -70.2461 -85.8189 -92.0590
quadrupole: 0.2505 -0.5499 -5.0462
quadrupole: 12.4619 -3.1109 -9.3510 0.2505 -0.5499 -5.0462
hfenergy: -668.2368288 hartree
pointgroup: C01 [X(C12H11N1O2)]
dipole: 0.6831312 -0.1182122 0.3648546 debye
dipolederiv: -0.8368864 0.1760908 -0.38458 0.2108572 -0.3649526 0.195644 -0.4501659 0.2691964 -0.7436551 -0.4745878 0.0629904 -0.1711441 0.0084642 -0.9212022 -0.2987848 -0.1987508 -0.0889482 -0.5704545 -0.3051745 -0.0923851 0.0053689 0.0940935 -0.3429808 -0.0011419 0.0037637 -0.0073511 -0.2481992 -0.0146096 -0.1327331 0.0016736 0.2858216 -0.1977958 0.012565 0.035188 -0.0701245 0.046462 0.3328389 0.1090644 -0.0013516 -0.400152 -0.2294692 -0.0108285 0.0085724 0.0881387 0.0211053 0.0278925 0.1934076 -0.0384874 0.1452588 -0.3287541 -0.0166493 -0.021216 -0.0117925 -0.0573062 0.2400176 0.1256347 -0.0012757 -0.2065221 -0.0346586 -0.0073003 -0.0149777 0.0131454 0.0731793 0.0953461 0.1995849 0.0040289 0.5312753 0.6147165 0.0115152 -0.0242785 -0.0120011 0.007777 -0.1020926 0.0022145 -0.0054298 -0.0138546 0.0822444 -0.0037958 -0.0167824 0.0314178 -0.1352277 -0.2279189 -0.0233141 -0.0161019 -0.014368 0.0385701 -0.0046247 -0.0828421 -0.0365049 0.0621097 -0.0304673 -0.0627668 -0.000551 -0.0877892 0.0834086 0.0044491 0.007213 0.0018241 -0.159889 -0.1477516 -0.1732072 0.0002737 -0.1442117 -0.1609156 -0.0003816 0.0318754 0.020719 0.0526516 -0.0620898 0.0757041 0.0040843 0.1246694 0.1425788 0.0102828 0.0158592 0.0138898 -0.1521241 0.9076873 -0.3733651 0.6327035 -0.3968562 1.4057422 0.1744075 0.6707397 -0.0417434 0.9069983 0.1073906 -0.0906467 0.0021675 -0.1520621 -0.0716219 0.0015682 0.0014971 -0.0007897 -0.1531012 0.1141479 0.0449887 0.0052917 -0.001358 -0.0170658 0.001065 -0.0063851 -0.0087901 0.1517741 -0.0013206 -0.0259434 -0.0413003 -0.0119456 0.1159209 -0.0438718 -0.08227 -0.0406959 -0.057561 0.0494258 0.0236838 0.0089019 0.1148042 -0.0543912 -0.0734679 0.037408 -0.0625401 0.0846886 0.0188003 -0.0441618 0.0263788 -0.0786181 -0.0006049 0.1086622 0.0910516 0.1012666 0.0194723 0.0789957 0.0182605 -0.001473 0.07879 -0.039773 -0.0019442 -0.0006595 -0.0006488 0.1591266 0.0549009 0.1466078 0.0168609 0.0328343 -0.0302589 -0.017921 0.0038616 -0.0242851 0.1151627 -0.013022 -0.040977 -0.1098538 -0.0175264 0.0652693 0.0449186 -0.1337718 -0.0162142 -0.0228 0.0107386 -0.0581702 0.0968868 -0.0432934 0.0673384 -0.02353 0.1183686 0.0281015 -0.0574437 -0.0194485 -0.1005668 -0.0033847 -0.1158011 -0.0307912 -0.0053441 -0.0068435 -0.0072198 0.1567884 -0.1349794 0.0410762 -0.0038003 0.0405664 0.0848037 -0.0001889 -0.005804 -0.0016397 0.1596175 0.3321668 -0.0010713 -0.025887 0.0169236 0.124643 -0.0553029 0.0193487 -0.1364102 0.3408485 unknown
polarizability: 207.4907256|13.5943059|164.0281914|7.7272671|1.7791008|70.7986204 unknown
InChI: InChI=1S/C12H11NO2/c1-7-8(2)13-10-6-4-3-5-9(10)11(7)12(14)15/h3-6,14H,1-2H3
charge 0 multiplicity 1
26 atoms
O  2.240077 -2.198071 1.001805
O  0.829729 -2.963119 -0.663286
N  -0.323095 2.05662 0.014473
C  -0.714709 -0.398166 -0.032216
C  1.593358 0.507998 0.024844
C  0.720409 -0.599069 0.014373
C  -1.185185 0.970577 -0.018552
C  1.005721 1.837876 0.025454
C  -1.68724 -1.451683 -0.064525
C  3.105205 0.394406 0.010302
C  -2.589267 1.244493 -0.033375
C  1.88287 3.073588 0.045794
C  -3.053472 -1.155718 -0.077986
C  1.235094 -2.005635 0.037715
C  -3.512616 0.198183 -0.062176
H  -1.356912 -2.492654 -0.103227
H  3.521368 0.580712 1.018739
H  3.451885 -0.601261 -0.29992
H  3.544645 1.145075 -0.669484
H  -2.896077 2.294636 -0.020197
H  1.241485 3.959744 0.163376
H  2.61704 3.044908 0.87208
H  2.457635 3.180365 -0.894546
H  -3.782536 -1.972952 -0.106806
H  -4.58742 0.409018 -0.073493
H  2.520005 -3.154768 0.975835
