program: Gaussian 09
title: 000292936
version: EM64L-G09RevD.01
frameworkgroup: C1[X(C3H8N2O3)]
method: RPBEPBE
basis: SDD
operation: Freq
keyword: #pfreq=noraman
keyword: PBEPBE/SDD
title: #p freq=noraman PBEPBE/SDD
converged: YES YES NO NO
title: Mulliken charges:
elementType: O O O N N C C C H H H H H H H H
charge: -0.412785 -0.443107 -0.235378 -0.623797 -0.288304 -0.132501 -0.393001 0.143937 0.269554 0.245727 0.220513 0.296650 0.304276 0.297914 0.382407 0.367897
chargesum: 0.00000
title: Mulliken charges with hydrogens summed into heavy atoms:
elementType: O O O N N C C C
charge: -0.030378 -0.075210 -0.235378 -0.022872 0.009610 0.137053 0.073239 0.143937
polarizability: 7.10789188e+01 -3.75053870e-01 5.82153898e+01 -3.38866696e+00 1.04637407e+00 4.62577167e+01
1716.lowfreq: -4.6174 0.0004 0.0004 0.0005 1.7571 11.9695 45.7976 71.9993 117.6878
frequency: 45.7782 71.9478 117.6818 182.8729 253.3845 286.3148 305.5245 352.9188 401.5825 448.9314 541.3065 564.0837 604.9143 608.4413 680.7458 744.0989 832.9959 902.5934 957.1109 992.3678 1049.7277 1086.9216 1157.8509 1188.1812 1236.9578 1251.7145 1265.6549 1309.8654 1340.7190 1377.7759 1420.0552 1433.8147 1599.7433 1664.0705 2969.0210 2970.5575 3045.2416 3367.9080 3467.4294 3519.0990 3545.1759 3605.5447
redmass: 5.5638 6.6188 4.3769 4.2120 2.1282 2.5661 1.8113 1.3054 2.4322 2.8711 3.6213 1.8426 1.6209 1.5597 3.1622 3.2273 3.5542 2.5008 1.8059 3.9044 2.5967 1.9810 1.5886 1.5056 1.3286 1.3682 1.4649 1.2346 1.3352 1.8709 1.1199 1.1038 1.2277 4.6064 1.0630 1.0763 1.1043 1.0761 1.0439 1.0641 1.0683 1.1001
irintensity: 3.8613 2.5512 0.3146 1.7687 25.5001 26.0136 40.1422 111.6456 8.3052 0.6305 26.8081 71.0622 317.0357 45.3003 88.4258 66.3406 6.3285 22.1501 48.8214 18.9335 262.3384 11.7710 13.2137 10.5389 2.9930 29.4932 27.1294 13.9026 5.7193 19.5345 7.7624 9.3919 171.1464 164.6574 33.6045 20.4025 28.4188 0.8020 2.8575 28.9124 18.3703 32.3927
temp: 298.150 k
press: 1.00000 atm
elementType: 8 8 8 7 7 6 6 6 1 1 1 1 1 1 1 1
symmnumber: 1
zpe: 327589.1 jmol-1
zpe.correction: 0.124772 hartree
zpe.thermalcorrener: 0.134083 hartree
zpe.thermalcorrenthalpy: 0.135027 hartree
zpe.thermalcorrgfe: 0.090108 hartree
zpe.sumelectzpe: -453.573692 hartree
zpe.sumelectthermal: -453.564381 hartree
zpe.sumelectthermalent: -453.563437 hartree
zpe.sumelectthermalfe: -453.608357 hartree
dipole: 0.9951 -0.9559 1.6094
dipole: 2.1199
quadrupole: -45.9867 -49.3464 -45.1041
quadrupole: 9.1169 1.5071 -0.5769
quadrupole: 0.8257 -2.5340 1.7083 9.1169 1.5071 -0.5769
hfenergy: -453.6984643 hartree
pointgroup: C01 [X(C3H8N2O3)]
dipole: 0.5061246 -0.0698035 -0.6592259 debye
dipolederiv: -0.3011849 0.1445135 -0.0101828 0.1451654 -1.0855739 0.3397983 -0.0124872 0.3715743 -0.5513109 -0.6822418 -0.0330905 -0.1324365 -0.1199172 -0.3546754 -0.278931 -0.1096441 -0.1693468 -0.2174877 -0.8944166 -0.3157387 -0.006849 -0.1728308 -0.7103368 0.1451709 -0.1618617 0.0624894 -0.3689019 -0.3767508 0.0021707 0.1051716 -0.0000367 -0.5226555 0.0132891 0.1684435 0.1248984 -0.8808454 -0.147932 0.1730262 0.0743466 0.253284 -0.1645648 0.2317428 0.0074529 0.2169684 -0.0123083 -0.3585244 0.115555 -0.1955562 -0.0003287 0.4840092 -0.1477857 -0.0802557 -0.0652296 0.3321526 0.483411 -0.08642 0.0523114 -0.003234 0.1877073 0.0033299 -0.1491556 0.0191588 0.030972 1.2671016 0.1879029 0.2192498 0.098755 1.3054597 -0.4441697 0.3734184 -0.4418579 0.4351124 0.0965294 -0.0482572 -0.0028161 -0.0054492 -0.1303206 -0.007309 0.0052606 -0.0467951 0.0069428 -0.0140052 -0.0182811 0.0189509 0.0272714 -0.0742426 0.1545719 0.0083493 0.1023564 -0.0096979 0.0118993 -0.032959 -0.0391207 0.0039773 -0.0321383 -0.12575 -0.0296718 -0.0879683 0.000135 0.1721249 0.0723946 -0.0289391 0.0646784 0.1569976 0.0492243 -0.0229417 -0.039686 0.3661621 0.1958237 -0.0751688 -0.0283343 -0.0485371 0.167278 0.0228125 -0.0907164 -0.0718395 0.324288 0.0255554 -0.0292056 0.0369194 -0.115489 0.2140244 -0.0438331 0.1307705 -0.0952041 0.0651234 0.1283329 -0.0253186 -0.0934401 -0.0852839 0.3446152 -0.0026245 -0.0743721 0.0129556 0.3492088 0.3942775 -0.0311235 0.0307251 -0.0420249 0.2144165 0.0904633 0.0374111 0.107526 0.1304551 unknown
polarizability: 69.9113011|2.1167125|55.1843065|5.8225394|-5.0470413|50.4564177 unknown
InChI: InChI=1S/C3H8N2O3/c4-2(1-5-8)3(6)7/h2,5-6,8H,1,4H2
charge 0 multiplicity 1
16 atoms
O  -1.627345 1.381648 -0.756408
O  2.681233 0.533313 0.76366
O  -2.591026 -0.647821 -0.16365
N  -0.374336 -1.324211 1.390447
N  2.105642 -0.689264 0.101152
C  -0.272366 -0.143361 0.537035
C  0.838078 -0.280644 -0.558914
C  -1.609658 0.128142 -0.135149
H  -0.013754 0.763276 1.121601
H  0.938171 0.671214 -1.118681
H  0.574749 -1.098525 -1.258969
H  0.507544 -1.838932 1.461923
H  -1.207939 -1.89467 1.225074
H  2.816958 -0.923277 -0.614587
H  -2.512152 1.521846 -1.190433
H  2.717402 0.267666 1.719798
