program: Gaussian 09
title: 000292959
version: EM64L-G09RevD.01
frameworkgroup: C1[X(C15H14ClNO2)]
method: RPBEPBE
basis: SDD
operation: Freq
keyword: #p
keyword: freq=noraman
keyword: PBEPBE/SDD
title: #p freq=noraman PBEPBE/SDD
converged: YES YES NO NO
title: Mulliken charges:
elementType: Cl O O N C C C C C C C C C C C C C C C H H H H H H H H H H H H H H
charge: -0.153431 -0.236853 -0.054305 -0.302854 0.236341 0.253188 0.334446 0.122513 0.351017 -0.449344 0.148747 -0.780742 -0.354498 -0.779949 -0.396943 -0.814296 -0.233236 -0.224331 -0.194203 0.261140 0.255662 0.257968 0.274644 0.268552 0.256136 0.249703 0.247894 0.243131 0.255219 0.244919 0.236338 0.240499 0.236930
chargesum: 0.00000
title: Mulliken charges with hydrogens summed into heavy atoms:
elementType: Cl O O N C C C C C C C C C C C C C C C
charge: -0.153431 -0.236853 -0.054305 -0.302854 0.236341 0.253188 0.334446 0.122513 0.351017 -0.188204 0.148747 0.007532 -0.085946 -0.026218 -0.153812 -0.077819 0.007263 0.012598 -0.194203
polarizability: 2.49233438e+02 1.54620075e+01 1.70638571e+02 5.27412547e+00 -7.73421421e+00 1.40423738e+02
1716.lowfreq: -4.9033 -0.0016 -0.0008 0.0001 5.8519 7.9439 34.1897 42.8090 52.3789
frequency: 34.1632 42.7876 52.3602 66.9755 76.6542 102.9820 127.9495 140.2781 153.2702 164.1332 191.4444 198.7263 211.3399 241.5353 275.3092 315.7256 322.3803 337.6464 356.3843 370.2846 420.7803 453.1138 462.1503 504.7778 516.3603 533.4399 543.7614 571.5220 580.6064 589.7920 635.5045 650.1266 701.4144 734.5910 753.8264 772.5410 785.0165 814.6759 869.7193 879.1395 955.5965 966.1738 972.3162 988.1338 997.2671 1037.5204 1042.8464 1044.6877 1046.3700 1050.4949 1071.1292 1108.1441 1137.2652 1176.6707 1198.6405 1212.8615 1224.1059 1273.9328 1283.7893 1335.0528 1369.1303 1387.4873 1406.0088 1410.8997 1417.0159 1433.8785 1455.1852 1461.1642 1462.6533 1464.8009 1470.8753 1474.1057 1486.0457 1552.2498 1555.7006 1586.8011 1611.9030 1651.7350 1755.7670 2982.7101 2991.5638 3002.3128 3056.3859 3068.8208 3077.4244 3095.8077 3113.0323 3130.7753 3137.6938 3141.4074 3151.2771 3170.4241 3174.6048
redmass: 6.5520 6.5594 8.8064 4.8550 3.7904 1.0550 1.7180 3.6076 2.1773 3.1443 2.6729 1.8921 2.1050 4.3937 6.5302 3.6478 3.6243 4.7646 5.7365 4.1472 7.4087 4.0473 3.0869 5.3833 4.5115 5.3865 4.2350 4.8254 5.4288 5.0475 6.0502 4.8372 5.7326 2.5582 3.3969 2.0560 3.2624 3.8353 1.5016 1.3018 1.5263 2.7173 2.5969 1.6902 1.3299 1.6672 1.9387 1.6048 1.5953 1.5150 2.2702 2.9187 2.3221 1.0620 2.9644 2.4836 3.1825 3.2121 1.5723 3.3062 8.2383 6.1793 1.2385 1.2346 1.2160 2.0218 1.1608 1.0549 1.0882 1.0795 1.0473 1.3113 2.0843 7.6520 5.9698 6.3726 6.6364 7.4234 13.0048 1.0385 1.0383 1.0400 1.0964 1.0972 1.0971 1.0988 1.0987 1.0868 1.0898 1.0969 1.0944 1.1008 1.0926
irintensity: 1.7405 0.6184 1.7134 0.3282 0.1589 0.3979 0.8368 1.2929 0.4378 0.7839 0.0721 0.4619 0.3773 0.2603 2.3721 5.0818 1.6669 6.2817 40.3375 3.2167 10.7283 3.0278 10.4652 5.4254 5.1906 12.6498 38.2314 3.7131 8.3301 23.8446 23.0116 3.9386 21.8119 42.0561 6.0010 28.7108 65.6248 52.9230 28.5052 0.1084 0.3087 9.0739 1.5827 1.1574 0.0051 11.5077 6.2935 3.3687 6.0144 7.3491 4.5759 34.9219 42.8571 1.4344 5.0954 10.0996 8.5424 35.5209 3.3726 63.9391 3.9796 239.3397 13.5006 52.7465 10.2602 4.6708 25.4822 11.3036 8.6738 29.8131 20.0064 14.7989 75.4219 64.1127 94.4324 5.2450 7.5922 245.1670 376.9099 12.9235 15.3580 9.8207 10.6042 8.4794 6.2582 20.4502 15.9793 3.8040 3.4336 4.8846 17.8169 18.9124 2.6661
temp: 298.150 k
press: 1.00000 atm
elementType: 17 8 8 7 6 6 6 6 6 6 6 6 6 6 6 6 6 6 6 1 1 1 1 1 1 1 1 1 1 1 1 1 1
symmnumber: 1
zpe: 660253.9 jmol-1
zpe.correction: 0.251477 hartree
zpe.thermalcorrener: 0.269982 hartree
zpe.thermalcorrenthalpy: 0.270926 hartree
zpe.thermalcorrgfe: 0.204093 hartree
zpe.sumelectzpe: -1243.907839 hartree
zpe.sumelectthermal: -1243.889335 hartree
zpe.sumelectthermalent: -1243.888390 hartree
zpe.sumelectthermalfe: -1243.955223 hartree
dipole: -11.8151 -0.4757 -0.0622
dipole: 11.8248
quadrupole: -139.5378 -119.1909 -111.5546
quadrupole: -3.1257 1.3931 0.8611
quadrupole: -16.1100 4.2369 11.8731 -3.1257 1.3931 0.8611
hfenergy: -1244.1593162 hartree
pointgroup: C01 [X(C15H14Cl1N1O2)]
dipole: 4.6442682 0.2469218 0.1152039 debye
polarizability: 251.4092971|-8.589834|163.6861883|3.5745345|13.2481503|145.2002612 unknown
InChI: InChI=1S/C15H14ClNO2/c1-9-6-4-5-7-12(9)17-10(2)8-13(18)14(11(17)3)15(16)19/h4-8H,1-3H3
charge 0 multiplicity 1
33 atoms
Cl -3.063233 -2.420643 -1.292965
O  -3.697524 1.677885 0.120967
O  -4.213087 -1.147214 0.865133
N  0.267543 0.414601 0.183957
C  -0.744949 -0.554565 0.245298
C  1.668596 -0.005718 0.189608
C  -0.03556 1.792976 0.071089
C  -2.082213 -0.160644 0.182331
C  2.299532 -0.345318 -1.039041
C  -1.35117 2.199451 0.043208
C  -2.487872 1.280275 0.122769
C  -0.297405 -1.985833 0.451608
C  2.362647 -0.051718 1.417694
C  1.117476 2.767803 -0.004516
C  3.6614 -0.738188 -0.983882
C  1.550946 -0.289787 -2.357321
C  3.717527 -0.447253 1.447676
C  4.366097 -0.791938 0.239873
C  -3.197065 -1.124109 0.189036
H  -1.58725 3.264482 -0.028644
H  0.348371 -2.063876 1.344125
H  0.285081 -2.361455 -0.408062
H  -1.160712 -2.650482 0.582277
H  1.837442 0.218841 2.340446
H  1.73666 2.745669 0.910376
H  0.72329 3.787803 -0.130356
H  1.790723 2.548125 -0.852943
H  4.172418 -1.004629 -1.916242
H  0.712423 -1.010911 -2.385948
H  1.107331 0.707001 -2.537091
H  2.221755 -0.521217 -3.2009
H  4.256979 -0.485933 2.399467
H  5.416904 -1.100779 0.249773
