program: Gaussian 09
title: 000292942
version: EM64L-G09RevD.01
frameworkgroup: C1[X(C14H13NO4)]
method: RPBEPBE
basis: SDD
operation: Freq
keyword: #p
keyword: freq=noraman
keyword: PBEPBE/SDD
title: #p freq=noraman PBEPBE/SDD
converged: NO YES NO NO
title: Mulliken charges:
elementType: O O O O N C C C C C C C C C C C C C C H H H H H H H H H H H H H
charge: -0.440824 -0.275803 -0.438270 -0.241868 -0.353080 0.247414 0.338026 0.112655 0.394824 -0.476941 -0.761739 -0.791456 -0.355181 -0.353862 0.066038 -0.336210 -0.307834 0.258925 0.118185 0.280893 0.225739 0.256351 0.256786 0.246391 0.238283 0.238915 0.266669 0.265405 0.277509 0.280452 0.374077 0.389532
chargesum: 0.00000
title: Mulliken charges with hydrogens summed into heavy atoms:
elementType: O O O O N C C C C C C C C C C C C C C
charge: -0.066747 -0.275803 -0.048738 -0.241868 -0.353080 0.247414 0.338026 0.112655 0.394824 -0.196048 -0.022864 -0.067867 -0.088512 -0.088457 0.066038 -0.058701 -0.027382 0.258925 0.118185
polarizability: 2.69279701e+02 7.60136150e-01 1.37614423e+02 -1.47801974e+00 -2.34441840e-01 1.25143957e+02
1716.lowfreq: -107.6958 -33.1105 -5.2634 -0.0005 0.0005 0.0006 1.7059 11.2907 39.4970
frequency: -107.6933 -33.0400 39.4646 39.5593 69.9996 79.0189 122.2211 127.3027 143.8747 150.7077 163.0954 201.8399 212.7540 273.2766 294.5009 300.9684 370.8700 394.2133 400.4413 410.0341 465.5111 490.6923 499.2640 549.2008 573.6475 590.3455 605.6906 614.1756 618.9223 629.4772 659.4975 663.2172 691.8840 742.4478 753.2073 767.1222 800.6459 841.8277 862.0484 875.5714 973.0421 979.9671 990.6481 999.8868 1000.4091 1007.9368 1026.8107 1028.3708 1034.6767 1047.9239 1109.5247 1134.8665 1149.9092 1157.3934 1184.3299 1239.3789 1275.2213 1296.7075 1321.5911 1325.3257 1374.8021 1382.3990 1405.4918 1407.7808 1410.2372 1413.6373 1449.9660 1464.4163 1469.9290 1478.0013 1503.7661 1539.0022 1577.4554 1586.5850 1617.2688 1644.3192 1646.9741 2970.4232 2992.2002 3040.1254 3070.4707 3097.0614 3097.5755 3151.6663 3154.6612 3170.5157 3182.3879 3235.2253 3528.6579 3531.8734
redmass: 1.0147 4.3992 6.2052 6.2289 7.7663 8.6723 1.2778 6.9968 4.8548 2.1343 4.2901 5.5040 5.2473 3.4733 3.6771 4.1778 5.1983 6.7516 6.2608 2.8850 4.8743 3.9951 5.3505 1.3402 2.5171 3.2637 1.5420 5.6040 4.5416 2.9217 6.5502 4.6946 3.5143 5.8161 4.0925 5.5128 3.8371 1.3713 1.2414 1.7319 1.9851 2.5876 1.3706 1.3813 5.1170 4.7579 1.8650 2.4469 1.4354 1.4512 1.3347 1.6183 1.7073 1.8622 1.1767 4.6877 2.4317 1.3078 2.9449 5.2061 6.9346 4.5385 3.4143 1.4177 1.3749 2.4641 1.0440 1.0446 1.1034 1.2674 2.9906 8.2047 7.9518 6.5745 6.4568 8.1317 8.4248 1.0388 1.0366 1.0981 1.0969 1.0997 1.0970 1.0891 1.0905 1.0972 1.0963 1.0987 1.0640 1.0642
irintensity: 0.1805 0.3409 0.2556 0.1096 1.0341 0.8105 1.1672 0.3212 0.5000 3.0199 0.3663 0.4876 1.0418 6.1287 1.3162 1.9715 10.8573 12.7667 6.6915 0.3286 16.4550 26.3333 7.7015 105.8497 30.5974 17.9771 48.7195 0.4442 73.2899 32.4480 5.8429 4.3960 78.2539 24.4437 16.2038 7.2030 3.0770 25.9294 0.5629 46.5037 76.6245 189.2741 7.2432 0.4007 14.7960 304.4864 27.5142 65.0616 1.2115 5.7872 6.4284 171.0118 107.1162 15.0544 5.9265 8.7056 31.1119 9.6225 88.8680 49.5354 4.9278 34.9600 18.9828 46.2414 26.2461 113.1027 5.7867 20.6924 8.1491 3.0136 85.9973 99.3749 12.1519 25.9062 109.7787 451.6497 198.6741 41.4617 14.3074 17.6837 5.9116 6.5271 31.4667 1.0059 3.3269 2.5730 0.9128 2.3186 40.5354 54.7851
temp: 298.150 k
press: 1.00000 atm
elementType: 8 8 8 8 7 6 6 6 6 6 6 6 6 6 6 6 6 6 6 1 1 1 1 1 1 1 1 1 1 1 1 1
symmnumber: 1
zpe: 633825.4 jmol-1
zpe.correction: 0.241411 hartree
zpe.thermalcorrener: 0.257854 hartree
zpe.thermalcorrenthalpy: 0.258799 hartree
zpe.thermalcorrgfe: 0.196632 hartree
zpe.sumelectzpe: -895.612948 hartree
zpe.sumelectthermal: -895.596505 hartree
zpe.sumelectthermalent: -895.595560 hartree
zpe.sumelectthermalfe: -895.657727 hartree
dipole: -2.8576 1.7680 -1.3397
dipole: 3.6176
quadrupole: -114.0368 -111.5349 -107.5582
quadrupole: 6.4878 10.3004 0.8986
quadrupole: -2.9935 -0.4916 3.4851 6.4878 10.3004 0.8986
hfenergy: -895.854359 hartree
pointgroup: C01 [X(C14H13N1O4)]
dipole: -1.1168579 0.7017299 -0.5346874 debye
polarizability: 269.2974354|0.0342595|137.6099809|-0.5130963|-0.2277635|125.1306651 unknown
InChI: InChI=1S/C14H13NO4/c1-8-7-12(14(18)19)9(2)15(8)11-5-3-10(4-6-11)13(16)17/h3-7,16,18H,1-2H3
charge 0 multiplicity 1
32 atoms
O  5.509798 0.139513 0.001757
O  4.570383 -1.989912 0.01238
O  -5.371012 -0.38334 -1.220454
O  -5.486187 -0.387969 1.100714
N  0.916363 0.374864 0.0017
C  1.868166 -0.651439 0.007137
C  1.557655 1.647781 -0.005368
C  3.133663 -0.021163 0.002854
C  -0.515383 0.190439 0.003545
C  2.927834 1.409469 -0.004795
C  1.513141 -2.11006 0.014961
C  0.777277 2.931055 -0.010863
C  -1.213279 0.112674 1.232815
C  -1.214936 0.107107 -1.223813
C  4.400656 -0.738612 0.005753
C  -2.611715 -0.051946 1.233382
C  -2.614447 -0.058104 -1.224978
C  -3.316487 -0.136986 0.004868
C  -4.794907 -0.310924 0.057352
H  3.714583 2.160264 -0.008958
H  0.420912 -2.263928 0.016691
H  1.945158 -2.621752 -0.863192
H  1.946505 -2.612667 0.897658
H  1.478371 3.781485 -0.015305
H  0.126659 3.024922 -0.901483
H  0.128074 3.033172 0.879868
H  -0.654495 0.177219 2.171879
H  -0.656473 0.167276 -2.163445
H  -3.174793 -0.117373 2.169803
H  -3.169866 -0.12764 -2.164003
H  6.334193 -0.417278 0.005039
H  -6.354212 -0.499345 -1.123995
