program: Gaussian 09
title: 000292961
version: EM64L-G09RevD.01
frameworkgroup: C1[X(C15H10N2O7)]
method: RPBEPBE
basis: SDD
operation: Freq
keyword: #p
keyword: freq=noraman
keyword: PBEPBE/SDD
title: #p freq=noraman PBEPBE/SDD
converged: YES YES NO NO
title: Mulliken charges:
elementType: O O O O O O O N N C C C C C C C C C C C C C C C H H H H H H H H H H
charge: -0.180334 -0.188486 -0.176388 -0.179338 -0.179290 -0.428630 -0.240593 0.000932 0.003114 0.449549 0.194796 0.292250 0.292464 -0.526202 -0.540447 0.006209 0.255717 -0.744561 0.094286 -0.359213 -0.328068 -0.219508 -0.213912 0.094493 0.300906 0.324072 0.239270 0.239369 0.278501 0.268314 0.285620 0.245241 0.244464 0.395405
chargesum: 0.00000
title: Mulliken charges with hydrogens summed into heavy atoms:
elementType: O O O O O O O N N C C C C C C C C C C C C C C C
charge: -0.180334 -0.188486 -0.176388 -0.179338 -0.179290 -0.033225 -0.240593 0.000932 0.003114 0.449549 0.194796 0.292250 0.292464 -0.225296 -0.216375 0.006209 0.255717 0.012579 0.094286 -0.090899 -0.042448 0.025733 0.030552 0.094493
polarizability: 2.76176713e+02 1.84643568e+01 2.00567657e+02 -3.21044362e+01 1.51069572e+01 1.59887190e+02
1716.lowfreq: -8.6212 -5.8290 -4.8849 0.0004 0.0007 0.0007 14.9133 20.4250 42.9373
frequency: 14.7482 20.4092 42.9351 45.2357 50.9961 73.2156 90.4359 102.0332 113.9439 142.8463 145.6905 159.2731 179.4917 185.2773 225.9161 238.1430 288.2843 306.6643 314.4931 327.4121 364.2390 370.5235 384.4523 413.2822 439.0957 447.2498 460.2090 488.6185 534.3748 568.0268 594.3042 600.1016 609.6398 634.1171 650.9749 680.0083 686.5458 698.5270 718.3370 722.9147 734.5911 747.1489 767.1774 783.8194 792.9959 834.6355 855.0069 901.4395 939.5441 966.0566 976.1777 981.4343 1009.2594 1012.4946 1023.1786 1034.4425 1044.2546 1085.0277 1104.7037 1163.1242 1168.2490 1181.4536 1201.1144 1208.4243 1218.1706 1221.9917 1261.5492 1286.2582 1329.5610 1352.1362 1369.6706 1373.6628 1380.5698 1400.7181 1409.5005 1428.7785 1450.4586 1470.2674 1472.9357 1477.2353 1549.4710 1572.9255 1581.5944 1599.7899 1613.5127 1624.9228 3014.9665 3099.2913 3129.8931 3142.5603 3155.7194 3168.9181 3171.0176 3177.0129 3183.3131 3530.6699
redmass: 9.1624 6.9940 7.1446 10.8937 10.5459 12.9151 6.8535 7.2433 5.5212 6.6658 4.7763 1.3022 5.5283 8.2609 6.0172 6.3590 6.0049 5.7906 11.6688 8.1537 8.3793 3.3421 6.5122 3.2805 6.0475 6.1478 4.7069 6.6174 5.2214 5.1751 1.8208 2.2321 5.3545 5.6653 6.3494 10.2819 3.8900 6.7140 3.0772 7.7170 4.6491 8.3268 6.2579 3.0731 1.8719 6.6236 7.6102 1.4438 1.5951 1.4907 2.2697 2.3538 1.3796 4.8947 1.5179 1.5635 2.2531 2.5313 2.0528 1.8862 2.6986 1.0742 3.7885 4.2481 3.3191 2.7454 2.5582 1.9898 2.7158 3.8177 7.0523 8.9025 10.4544 1.1738 5.8933 2.1989 1.1533 1.7802 1.6676 2.9334 8.1856 7.2859 9.0468 6.3339 7.7801 8.6101 1.0388 1.0942 1.1014 1.0866 1.0913 1.0965 1.0918 1.0928 1.0982 1.0644
irintensity: 0.6112 0.0554 1.7078 0.3326 0.5559 1.0675 4.4539 2.1849 1.3357 5.4954 3.6938 1.0451 0.2939 4.0701 2.6917 1.6785 5.8853 1.0938 0.4061 5.7532 3.2385 0.7043 8.7787 8.7101 6.8191 0.8885 0.8478 11.0191 9.8337 3.9230 100.4479 43.2637 17.8295 2.3604 10.8047 43.9187 59.0962 8.7090 52.1122 1.3268 19.8817 4.7840 3.6665 22.1611 24.9719 5.5455 17.9664 0.2165 24.2422 11.2466 23.6062 20.5359 5.8171 207.7097 2.5700 2.7566 8.0378 36.7561 75.5781 60.3664 21.6066 0.4903 98.6624 149.5437 93.4126 151.3967 84.1979 91.1793 90.7202 16.3685 165.0422 19.1868 13.6392 47.2985 10.0688 11.2196 14.2484 37.4872 4.8097 5.7045 48.1349 39.8493 105.8704 30.3811 22.4273 256.8325 1.2100 8.4294 7.8351 1.2630 6.3554 10.4152 2.8189 10.3070 8.7014 63.6756
temp: 298.150 k
press: 1.00000 atm
elementType: 8 8 8 8 8 8 8 7 7 6 6 6 6 6 6 6 6 6 6 6 6 6 6 6 1 1 1 1 1 1 1 1 1 1
symmnumber: 1
zpe: 603323.3 jmol-1
zpe.correction: 0.229794 hartree
zpe.thermalcorrener: 0.251016 hartree
zpe.thermalcorrenthalpy: 0.251960 hartree
zpe.thermalcorrgfe: 0.176696 hartree
zpe.sumelectzpe: -1211.814039 hartree
zpe.sumelectthermal: -1211.792817 hartree
zpe.sumelectthermalent: -1211.791872 hartree
zpe.sumelectthermalfe: -1211.867137 hartree
dipole: 5.2084 2.2616 -0.2133
dipole: 5.6822
quadrupole: -126.4932 -166.9123 -124.2028
quadrupole: -2.2903 1.9369 2.4478
quadrupole: 12.7096 -27.7095 14.9999 -2.2903 1.9369 2.4478
hfenergy: -1212.0438324 hartree
pointgroup: C01 [X(C15H10N2O7)]
dipole: 2.0255003 0.9451669 -0.0409145 debye
polarizability: 270.831399|27.629468|194.9224163|-35.1024885|19.1027105|170.877744 unknown
InChI: InChI=1S/C15H10N2O7/c1-8-12(16(21)22)6-9(7-13(8)17(23)24)14(18)10-4-2-3-5-11(10)15(19)20/h2-7,19H,1H3
charge 0 multiplicity 1
34 atoms
O  0.997697 -2.472219 -1.387407
O  -0.660717 3.499176 -0.432387
O  -3.856005 -2.738936 -0.664421
O  -2.370124 3.358178 1.068499
O  -4.709402 -1.419546 0.988339
O  2.899166 0.123972 2.823519
O  1.27624 -1.219068 1.853633
N  -1.549698 2.83107 0.224581
N  -3.821965 -1.697191 0.094228
C  -0.26391 -0.626567 -0.502929
C  -2.804644 0.625461 0.152499
C  -1.587808 1.356193 0.017501
C  -2.654886 -0.780059 -0.052766
C  -0.348334 0.76552 -0.30483
C  -1.439652 -1.400512 -0.387327
C  1.020402 -1.314598 -0.88302
C  2.329361 -0.554787 -0.793792
C  -4.145379 1.284476 0.396368
C  2.911792 -0.10134 0.428164
C  3.013321 -0.315004 -2.009619
C  4.139609 0.608867 0.408291
C  4.233199 0.397161 -2.022947
C  4.793149 0.868483 -0.813143
C  2.270244 -0.461047 1.720882
H  0.528603 1.410635 -0.408349
H  -1.396464 -2.480192 -0.557585
H  -4.16769 2.304899 -0.014097
H  -4.965727 0.693641 -0.036997
H  -4.344421 1.368688 1.479105
H  2.582894 -0.690497 -2.943369
H  4.572898 0.934722 1.35752
H  4.744186 0.5798 -2.974041
H  5.738909 1.419591 -0.821388
H  2.441957 -0.172471 3.655784
