program: Gaussian 09
title: 000022466
version: EM64L-G09RevD.01
frameworkgroup: C1[X(C7H13ClO2)]
method: RPBEPBE
basis: SDD
operation: Freq
keyword: #p
keyword: freq=noraman
keyword: PBEPBE/SDD
title: #p freq=noraman PBEPBE/SDD
converged: NO YES NO NO
title: Mulliken charges:
elementType: Cl O O C C C C C C C H H H H H H H H H H H H H
charge: -0.039850 -0.186586 -0.155722 -0.369184 -0.346718 -0.386264 -0.354487 -0.299517 -0.692134 0.095693 0.194457 0.194341 0.192682 0.192656 0.221507 0.221634 0.196372 0.196274 0.242172 0.242046 0.218568 0.211012 0.211047
chargesum: 0.00000
title: Mulliken charges with hydrogens summed into heavy atoms:
elementType: Cl O O C C C C C C C
charge: -0.039850 -0.186586 -0.155722 0.019615 0.038620 0.056878 0.038159 0.184701 -0.051506 0.095693
polarizability: 1.30702378e+02 7.50238910e+00 8.73074144e+01 -9.36862070e-03 2.20556827e-02 6.49215037e+01
1716.lowfreq: -2.2127 -0.0023 -0.0019 -0.0016 5.6348 14.7981 31.4124 52.0387 52.9479
frequency: 29.8272 50.1021 52.4151 77.2681 109.9975 139.0530 140.4379 169.9502 200.8983 227.8939 263.4221 372.7041 411.0748 429.7463 481.7992 615.7756 728.7117 750.6600 767.7050 798.0813 858.7084 885.5973 893.5836 988.2950 1007.6250 1047.9641 1060.9051 1075.4524 1088.0184 1127.9752 1143.7173 1195.1122 1240.5226 1244.5691 1277.0034 1293.4399 1294.9478 1295.6897 1339.9894 1357.9286 1370.1949 1392.5594 1465.0664 1467.7659 1469.3313 1476.3922 1477.9235 1484.6489 1490.8364 1695.0038 2959.0825 2963.4397 2972.6442 2975.4439 2996.4136 2999.6423 3011.8050 3012.3842 3036.0979 3058.0258 3072.0464 3075.2199 3091.1280
redmass: 5.4566 2.0098 5.0272 2.8714 1.8258 2.3324 4.1593 3.0661 6.3812 1.1345 3.8701 4.9037 5.9249 4.9661 3.9007 11.7440 1.0671 1.0916 10.7452 1.1506 7.2232 1.1987 1.9574 1.1487 4.0864 3.2190 5.0591 2.9824 2.3704 2.8123 1.3880 1.5479 1.2806 1.2993 1.1133 1.0902 1.3031 1.1034 1.3934 1.6101 1.4839 1.2161 1.0815 1.0705 1.0774 1.0699 1.0419 1.0814 1.0964 11.9110 1.0588 1.0590 1.0594 1.0363 1.0981 1.0599 1.0562 1.1018 1.1043 1.1044 1.1008 1.0993 1.1095
irintensity: 1.4506 0.0821 0.5664 0.0810 0.3977 0.0690 0.4929 3.0735 6.3155 0.0130 4.1950 13.3747 1.8161 28.9577 1.3656 10.4694 12.4419 0.4439 89.3053 2.1249 10.4845 0.9755 2.4104 0.1519 19.8731 12.6240 520.7385 111.3823 60.8090 4.7935 2.1168 0.0056 6.5044 0.0138 0.0059 0.1640 2.0773 0.9268 3.1604 0.0957 13.7292 11.9785 0.3024 0.1620 3.5791 1.2124 12.9526 3.6346 28.2090 345.4111 0.1036 3.7660 93.6821 35.8989 0.6740 14.6893 30.8586 0.3298 42.7230 17.0216 86.0437 50.5304 56.4831
temp: 298.150 k
press: 1.00000 atm
elementType: 17 8 8 6 6 6 6 6 6 6 1 1 1 1 1 1 1 1 1 1 1 1 1
symmnumber: 1
zpe: 499726.0 jmol-1
zpe.correction: 0.190336 hartree
zpe.thermalcorrener: 0.202925 hartree
zpe.thermalcorrenthalpy: 0.203869 hartree
zpe.thermalcorrgfe: 0.149070 hartree
zpe.sumelectzpe: -884.231907 hartree
zpe.sumelectthermal: -884.219318 hartree
zpe.sumelectthermalent: -884.218373 hartree
zpe.sumelectthermalfe: -884.273172 hartree
dipole: 4.3283 0.0982 -0.0055
dipole: 4.3294
quadrupole: -81.2861 -72.6330 -66.3543
quadrupole: 2.9932 0.0157 -0.0142
quadrupole: -7.8617 0.7915 7.0701 2.9932 0.0157 -0.0142
hfenergy: -884.4222426 hartree
pointgroup: C01[X(C7H13Cl1O2)]
dipole: -1.6989016 -0.1224942 -0.0014477 debye
dipolederiv: -0.6943051 -0.3759035 0.0109835 -0.4883731 -0.5639201 0.0145714 0.0132937 0.0138766 -0.0912913 -1.97622 -0.086872 -0.0019893 0.1475799 -0.4810511 0.0091231 -0.0073857 0.0079647 -0.2375477 -0.7047776 0.0138095 -0.0015027 0.1873041 -1.1015471 0.0283798 -0.0083364 0.0309435 -0.2548428 -0.0337449 0.0293892 -0.0010889 0.1408022 0.0994088 0.0025018 -0.0041969 0.0022033 0.1918438 -0.0218754 -0.0134013 -0.0000877 -0.0959597 0.070722 0.0021521 0.0015171 0.002284 0.1804344 -0.1913871 -0.014429 -0.0003821 -0.0421705 0.0368001 0.0031789 0.0003232 0.0034387 0.1410121 0.0191418 0.0132491 -0.0005449 0.0829797 0.1010588 0.0016025 -0.0019084 0.0012851 0.1755455 1.02365 0.1114229 -0.0019741 0.2753005 0.2902672 0.0030439 -0.0081253 0.0030401 0.3614165 -0.0783708 0.0421608 -0.001185 -0.0038977 0.0499202 0.0008599 -0.0001677 0.0010262 0.0951733 2.3777297 0.3412852 -0.0053196 -0.0760326 1.792069 -0.0519979 0.0090492 -0.0525777 0.2452831 0.0461028 -0.0004754 0.0049205 -0.0035203 -0.0463705 -0.113158 0.006617 -0.1378286 -0.0779712 0.0464044 -0.0006049 -0.0047565 -0.003709 -0.0338932 0.1109906 -0.0063118 0.1356435 -0.0904511 0.0349609 -0.0047989 -0.0050284 0.0059244 -0.0461656 -0.1154019 -0.0022055 -0.1387522 -0.0813726 0.0349921 -0.0055818 0.0060554 0.0052015 -0.0352676 0.1134031 0.0027653 0.1367119 -0.0922005 0.0690361 0.0043802 0.0077919 0.0137363 -0.0123806 -0.097746 -0.0119072 -0.1120127 -0.0521839 0.0691577 0.0029838 -0.0072504 0.0137498 -0.0001216 0.0946624 0.0119785 0.1087928 -0.0638877 0.02922 0.0249945 0.0260947 -0.0027072 -0.0506529 -0.1229274 0.0037084 -0.1511607 -0.0839953 0.0293585 0.0236155 -0.0267063 -0.0030842 -0.0400652 0.1212066 -0.0032481 0.1495307 -0.094693 -0.0317618 -0.0050316 -0.0255572 -0.0603187 0.0031528 0.068125 -0.0186964 0.0876924 -0.0530378 -0.0315317 -0.0034486 0.0255896 -0.0590997 -0.0073035 -0.0715016 0.0225472 -0.0909629 -0.0429937 -0.1772706 -0.0967355 0.0015767 -0.1313777 0.0056384 0.0017702 0.0023381 0.0018034 0.1012768 0.0807688 -0.0003739 -0.0232754 0.04942 -0.0203574 -0.122646 0.0240155 -0.1387216 -0.0825734 0.0807221 0.0003654 0.0236363 0.0482522 -0.0099409 0.1198078 -0.0256638 0.1357799 -0.0929432 unknown
polarizability: 129.8594857|9.5984558|88.1271171|-0.1699806|-0.7294789|64.9446937 unknown
InChI: InChI=1S/C7H13ClO2/c1-2-3-4-5-6-10-7(8)9/h2-6H2,1H3
charge 0 multiplicity 1
23 atoms
Cl 4.619276 1.250117 -0.030229
O  2.113151 0.499634 -0.013226
O  3.623808 -1.294306 0.053556
C  -1.602023 -0.46119 0.00911
C  -2.892634 0.388925 -0.013044
C  -0.321642 0.409104 -0.012046
C  -4.181031 -0.464848 0.001602
C  0.935053 -0.453567 0.016893
C  -5.465553 0.391302 -0.016973
C  3.340735 -0.095514 0.009101
H  -1.602731 -1.147473 -0.862878
H  -1.604049 -1.103122 0.914285
H  -2.897396 1.07326 0.860456
H  -2.892049 1.03504 -0.915242
H  -0.316819 1.091878 0.858364
H  -0.311334 1.040119 -0.920656
H  -4.176813 -1.146897 -0.872937
H  -4.179342 -1.112776 0.901747
H  1.016445 -1.059751 0.937246
H  1.017959 -1.117856 -0.862309
H  -6.372507 -0.240231 -0.005243
H  -5.508493 1.060949 0.862542
H  -5.50671 1.025003 -0.922818
