program: Gaussian 09
title: 000292934
version: EM64L-G09RevD.01
frameworkgroup: C1[X(C9H10ClNO2)]
method: RPBEPBE
basis: SDD
operation: Freq
keyword: #p
keyword: freq=noraman
keyword: PBEPBE/SDD
title: #p freq=noraman PBEPBE/SDD
converged: YES YES NO NO
title: Mulliken charges:
elementType: Cl O O N C C C C C C C C C H H H H H H H H H H
charge: -0.062006 -0.205908 -0.267434 -0.306834 0.481087 -0.446181 -0.425113 -0.336782 -0.205893 -0.214688 -0.092241 0.284753 -0.754428 0.215861 0.242294 0.235800 0.303385 0.255185 0.256542 0.314107 0.257488 0.211472 0.259533
chargesum: 0.00000
title: Mulliken charges with hydrogens summed into heavy atoms:
elementType: Cl O O N C C C C C C C C C
charge: -0.062006 -0.205908 -0.267434 0.007273 0.481087 0.011974 -0.189312 -0.033397 0.049291 0.041854 -0.092241 0.284753 -0.025935
polarizability: 1.89118885e+02 -4.41738576e+00 1.18117259e+02 3.94449384e+00 1.20837626e-01 6.09359337e+01
1716.lowfreq: -9.9145 -5.5004 -3.2478 0.0013 0.0018 0.0022 28.7326 42.1258 63.2418
frequency: 28.7023 42.1212 63.2292 89.5043 95.4261 118.8065 172.2750 232.4548 263.7028 292.2871 333.4215 381.8604 390.8706 409.6470 411.3373 450.3360 509.2554 601.3509 608.9292 624.7547 662.3750 711.1491 805.8376 817.6444 839.6522 857.2397 904.7974 945.0533 958.4763 979.6403 996.0883 1002.5417 1032.4684 1037.1551 1069.3288 1110.8915 1175.5398 1186.6648 1228.3482 1237.1854 1298.6509 1336.3357 1381.7818 1383.3416 1398.5590 1415.1892 1448.8582 1464.9737 1468.2723 1478.4286 1588.0028 1602.8723 1618.4394 2998.0002 3002.0466 3081.1025 3099.3831 3104.7974 3130.6093 3139.5304 3169.9289 3173.1691 3529.3917
redmass: 5.8268 4.4257 4.9248 2.1087 5.7626 1.5716 5.7197 4.7674 8.1226 5.4660 3.5470 5.4726 2.8527 1.3844 2.7980 4.8521 3.2315 2.9115 4.7210 6.8610 5.2454 4.1438 1.8471 4.8494 1.4300 2.2809 3.7640 1.4544 2.2826 1.6030 1.5951 3.7103 3.0434 1.6630 2.6958 1.3438 1.0989 1.1336 2.5664 2.1916 1.2759 1.3442 3.0716 1.6930 2.5675 1.5380 1.0478 1.1186 1.0987 2.5112 7.4113 6.0663 7.5720 1.0358 1.0593 1.1063 1.1001 1.0989 1.0901 1.0922 1.0951 1.0959 1.0805
irintensity: 3.1766 0.4172 7.9445 4.5931 8.4912 0.7155 1.4507 1.4276 7.3097 0.9461 0.4476 24.1801 10.3338 102.7101 3.4985 2.7477 28.4532 5.5003 16.8665 0.4433 5.7926 0.3136 68.2179 59.3994 6.6267 13.6386 11.0661 3.9038 26.5604 3.0091 1.9736 34.3334 18.5977 9.8853 32.7191 8.3087 3.4256 2.1102 6.7515 66.2172 5.1268 31.4904 24.3488 46.1102 8.4597 77.6654 15.4137 7.1680 20.0112 73.8511 2.4463 20.8134 156.7509 11.0311 45.7798 12.5576 16.9845 8.6116 11.5080 7.7525 4.1886 4.4676 20.5878
temp: 298.150 k
press: 1.00000 atm
elementType: 17 8 8 7 6 6 6 6 6 6 6 6 6 1 1 1 1 1 1 1 1 1 1
symmnumber: 1
zpe: 454521.2 jmol-1
zpe.correction: 0.173118 hartree
zpe.thermalcorrener: 0.186308 hartree
zpe.thermalcorrenthalpy: 0.187252 hartree
zpe.thermalcorrgfe: 0.131342 hartree
zpe.sumelectzpe: -1013.205952 hartree
zpe.sumelectthermal: -1013.192762 hartree
zpe.sumelectthermalent: -1013.191818 hartree
zpe.sumelectthermalfe: -1013.247728 hartree
dipole: -4.5686 3.3944 -0.4123
dipole: 5.7065
quadrupole: -68.1893 -77.7948 -86.0055
quadrupole: -3.2527 -2.4559 -1.9495
quadrupole: 9.1406 -0.4649 -8.6757 -3.2527 -2.4559 -1.9495
hfenergy: -1013.3790696 hartree
pointgroup: C01 [X(C9H10Cl1N1O2)]
dipole: -1.6751816 -1.475625 0.2384136 debye
dipolederiv: -0.7979892 -0.2739519 0.10839 -0.3048775 -0.2586469 0.049898 0.1223064 0.051315 -0.0955603 -0.5992988 0.1438747 -0.0116106 0.0514185 -0.2610861 -0.0600132 -0.2522078 -0.0605223 -0.1845231 -0.7956311 -0.2724432 -0.078312 0.0091611 -0.8166091 -0.1589817 -0.0095877 -0.1893172 -0.4110515 -0.0140154 0.0713788 0.0224137 0.1907428 -0.6894166 -0.0450629 -0.0264474 -0.002966 -0.3827383 -0.0899328 -0.021248 -0.0336169 -0.0164295 -0.1134404 0.0191779 -0.047337 0.0402957 -0.0766723 0.8279966 0.0170237 0.0672426 0.0544453 0.4037468 -0.0498053 0.4225869 -0.1063367 0.2870532 0.0888831 0.071835 -0.0293644 -0.0895869 0.0940849 -0.0040261 -0.0667127 -0.0197964 -0.1430738 0.0416549 -0.0435452 -0.0079493 0.0634827 0.0121626 -0.0125749 0.0445731 0.0080737 -0.1121728 -0.2519306 -0.1825663 0.0245912 -0.22931 -0.1610981 0.0284504 0.0421459 0.0243978 -0.1164895 -0.3957862 -0.0465664 0.0341706 -0.0551777 0.0215569 0.0086668 0.0386818 -0.0085819 -0.1177237 1.1028756 0.4040171 -0.1826261 0.4569846 0.3526838 -0.0846341 -0.1960449 -0.0817767 -0.0299413 1.0083482 0.0379487 -0.0332065 -0.314825 1.2968714 0.3805491 -0.1214864 0.4259744 0.3426898 -0.4346507 0.0652878 0.0329702 0.1570939 0.0132341 -0.0045323 0.0637687 -0.0022804 0.0044405 -0.00602 0.0456326 -0.0378037 0.0070704 -0.1733317 0.0753415 -0.0679414 0.0333495 0.0447326 -0.0913929 -0.0207589 0.0774978 0.037583 0.0460647 -0.0798522 -0.0174689 -0.0185537 -0.0280874 0.0763553 -0.052954 0.0153779 -0.0260063 -0.1006345 0.0178051 0.0128915 0.0203545 0.1495086 0.1571601 0.0503586 0.0213249 0.0392029 0.0756988 0.0035446 0.0096123 0.001118 0.1473688 -0.0184541 0.0711741 0.0213664 0.0632455 0.0560187 -0.0030415 0.0271009 -0.0028489 0.1653564 0.0879802 -0.0227102 0.0122699 -0.0272187 -0.0411746 0.0138436 0.0086551 0.0144151 0.1612787 -0.0229296 -0.0204032 -0.0105429 0.0239903 0.2062469 -0.0725955 0.0350098 -0.0940075 0.299491 0.0595867 0.0054097 0.0167724 -0.0081239 0.1126098 -0.0433685 0.0671132 -0.0424976 -0.0600725 0.012293 -0.0492134 -0.0122129 -0.1307758 -0.0789002 -0.0697097 -0.0414604 -0.0728308 0.092709 0.0548976 0.0224198 -0.0171423 0.0479103 0.003359 0.0909208 -0.0477509 0.0830225 0.0634778 unknown
polarizability: 187.2332932|10.0293952|119.2710178|-10.3642822|-0.3097535|61.6677662 unknown
InChI: InChI=1S/C9H10ClNO2/c1-7(12)11-13-6-8-2-4-9(10)5-3-8/h2-5,11H,6H2,1H3
charge 0 multiplicity 1
23 atoms
Cl 4.815948 1.212191 -0.365761
O  -1.537748 -1.036176 -0.617633
O  -2.569059 1.27635 0.585527
N  -2.915387 -0.869636 -0.254527
C  0.670083 -0.729394 0.356668
C  -0.685519 -1.338076 0.605896
C  1.824903 -1.537201 0.226122
C  0.790022 0.682261 0.256524
C  3.094995 -0.954562 0.009218
C  2.0487 1.278329 0.033537
C  3.181734 0.446845 -0.082686
C  -3.360185 0.351462 0.239135
C  -4.878372 0.451572 0.361634
H  -0.638643 -2.436142 0.729311
H  -1.186453 -0.877787 1.474009
H  1.741643 -2.628631 0.290869
H  -0.113323 1.297342 0.342763
H  3.990555 -1.574367 -0.089341
H  2.148601 2.364664 -0.045861
H  -3.531569 -1.583983 -0.649739
H  -5.142324 0.680232 1.40785
H  -5.410366 -0.46468 0.051304
H  -5.226334 1.293588 -0.261317
