program: Gaussian 09
title: 000292938
version: EM64L-G09RevD.01
frameworkgroup: C1[X(C14H13NO4)]
method: RPBEPBE
basis: SDD
operation: Freq
keyword: #p
keyword: freq=noraman
keyword: PBEPBE/SDD
title: #p freq=noraman PBEPBE/SDD
converged: YES YES NO NO
title: Mulliken charges:
elementType: O O O O N C C C C C C C C C C C C C C H H H H H H H H H H H H H
charge: -0.438100 -0.282535 -0.437983 -0.243239 -0.346644 0.222156 0.348809 0.103880 0.458215 -0.477893 -0.786071 -0.792252 -0.508159 -0.372889 0.274952 0.074489 -0.197472 -0.341163 0.110433 0.281922 0.230349 0.236736 0.300582 0.246178 0.242653 0.236900 0.301685 0.267946 0.240192 0.281889 0.375610 0.388824
chargesum: 0.00000
title: Mulliken charges with hydrogens summed into heavy atoms:
elementType: O O O O N C C C C C C C C C C C C C C
charge: -0.062490 -0.282535 -0.049159 -0.243239 -0.346644 0.222156 0.348809 0.103880 0.458215 -0.195971 -0.018404 -0.066521 -0.206475 -0.104943 0.274952 0.074489 0.042720 -0.059274 0.110433
polarizability: 2.57892569e+02 4.57069349e+00 1.59751882e+02 -4.34143265e+00 -9.04055157e+00 1.14811706e+02
1716.lowfreq: -9.3105 -3.4592 0.0006 0.0009 0.0010 5.3548 23.1129 39.5383 51.0442
frequency: 22.9479 39.4902 51.0430 71.1935 79.0584 106.3015 111.5091 132.4071 152.4433 157.7599 177.4145 216.6610 235.1254 260.7377 291.3943 302.3032 352.4583 379.8619 411.1502 427.2766 432.6905 494.7579 509.2098 556.0084 572.1925 589.6421 594.2907 620.0609 629.8866 637.3288 646.7827 685.1242 697.7573 731.8781 742.4855 776.6412 818.0027 830.1461 841.3500 941.1938 956.4043 976.0638 983.5600 991.0802 1002.6330 1009.8917 1034.6921 1042.2484 1049.6697 1054.0369 1090.8825 1131.5073 1142.3605 1159.6617 1181.0853 1241.0095 1269.5031 1289.5173 1320.5337 1326.1490 1373.3366 1385.7400 1399.2800 1410.5697 1411.7068 1441.7674 1457.9377 1464.1547 1473.8157 1477.9271 1486.8078 1549.2242 1585.0267 1593.4696 1615.7066 1643.1960 1646.6562 2974.5541 2975.4297 3046.3409 3047.4713 3096.5682 3109.2287 3144.7471 3162.5389 3164.5729 3184.6448 3238.2163 3527.2222 3531.9587
redmass: 5.5547 5.5841 7.7669 5.8932 4.5723 1.2898 1.2125 4.3395 2.8613 3.5782 4.0418 4.7321 4.7460 3.6633 3.6271 3.6131 5.6999 5.8996 7.0379 3.2847 4.9573 4.1956 4.8061 1.3860 2.3400 3.4492 4.4600 1.8734 2.6221 4.6076 5.2501 5.7047 2.6504 3.2884 5.7244 4.6690 2.8618 2.0409 1.3854 1.4147 1.4700 2.9574 1.8409 5.0465 1.3630 5.1920 1.9401 1.4614 1.4732 2.0792 1.6485 1.6260 1.6077 1.8763 1.1086 3.8861 2.1151 1.6036 3.4547 3.1662 3.8802 8.4492 1.8991 1.4207 1.8447 2.9743 1.2338 1.0588 1.2423 2.1556 1.1216 6.1518 6.3659 6.7918 6.5114 8.1656 8.1303 1.0391 1.0387 1.0978 1.0967 1.0966 1.0972 1.0879 1.0940 1.0938 1.0969 1.0987 1.0640 1.0642
irintensity: 0.8346 0.3186 1.0626 0.9002 0.5000 0.6911 1.1032 0.6186 1.8804 1.8013 1.6595 0.3349 0.1267 0.8930 5.8340 3.9434 9.1187 6.6314 3.6916 7.0573 7.2848 7.8362 4.0805 103.2862 30.1464 84.5559 15.3154 108.0960 26.7471 13.2858 14.7132 21.5079 2.3407 61.6924 29.8111 5.4985 19.6900 11.6831 26.0076 3.5297 14.1166 204.3919 40.2946 4.1568 2.0122 328.1698 61.5588 6.3041 8.4161 24.9984 9.6605 48.2715 205.5224 55.9710 1.7100 12.2265 11.9620 38.0357 54.6034 67.7779 43.9971 2.0654 70.8906 28.2962 32.5263 201.4622 11.1820 15.3818 31.8814 58.5331 12.1486 96.0081 10.8847 62.7992 22.6115 381.0791 216.1092 35.7085 35.0616 8.7806 23.3847 18.6750 0.0623 7.4600 1.9084 7.4552 3.6364 2.2817 43.3194 54.5420
temp: 298.150 k
press: 1.00000 atm
elementType: 8 8 8 8 7 6 6 6 6 6 6 6 6 6 6 6 6 6 6 1 1 1 1 1 1 1 1 1 1 1 1 1
symmnumber: 1
zpe: 635206.7 jmol-1
zpe.correction: 0.241937 hartree
zpe.thermalcorrener: 0.259899 hartree
zpe.thermalcorrenthalpy: 0.260843 hartree
zpe.thermalcorrgfe: 0.194540 hartree
zpe.sumelectzpe: -895.613607 hartree
zpe.sumelectthermal: -895.595645 hartree
zpe.sumelectthermalent: -895.594701 hartree
zpe.sumelectthermalfe: -895.661004 hartree
dipole: -3.9673 -0.7369 2.4705
dipole: 4.7314
quadrupole: -103.0629 -108.8432 -111.0050
quadrupole: 9.8368 1.0012 -1.2404
quadrupole: 4.5741 -1.2061 -3.3680 9.8368 1.0012 -1.2404
hfenergy: -895.8555441 hartree
pointgroup: C01 [X(C14H13N1O4)]
dipole: -1.5741651 0.7897952 0.6027125 debye
polarizability: 258.1126553|-4.338322|116.0417653|-1.706076|-11.4711191|158.3017369 unknown
InChI: InChI=1S/C14H13NO4/c1-8-6-12(14(18)19)9(2)15(8)11-5-3-4-10(7-11)13(16)17/h3-7,16,18H,1-2H3
charge 0 multiplicity 1
32 atoms
O  5.239086 -0.02284 -0.681683
O  4.55067 -1.57598 0.90132
O  -5.316717 -0.494834 -0.605754
O  -3.762883 -0.73182 -2.316137
N  0.725317 0.400481 0.059743
C  1.745535 -0.419672 0.564163
C  1.254701 1.311949 -0.901268
C  2.936634 -0.023671 -0.084511
C  -0.657345 0.335347 0.457314
C  2.618155 1.059409 -0.989321
C  1.501042 -1.518248 1.557466
C  0.408966 2.346762 -1.587225
C  -1.645073 -0.030945 -0.479881
C  -1.025331 0.6477 1.789844
C  -3.005576 -0.078014 -0.086805
C  4.247756 -0.628436 0.123571
C  -2.380887 0.584585 2.181114
C  -3.376365 0.226558 1.247647
C  -4.010808 -0.461852 -1.116672
H  3.331444 1.583128 -1.621056
H  1.286655 -1.129823 2.571585
H  0.645161 -2.153058 1.261577
H  2.408192 -2.138253 1.624297
H  1.062059 3.013013 -2.174248
H  -0.329958 1.906717 -2.283121
H  -0.151926 2.971493 -0.866238
H  -1.376087 -0.294421 -1.507596
H  -0.251235 0.948808 2.503202
H  -2.659178 0.825896 3.211998
H  -4.430228 0.18132 1.534314
H  6.102175 -0.480539 -0.493452
H  -5.941252 -0.755959 -1.334489
