program: Gaussian 09
title: 000292914
version: EM64L-G09RevD.01
frameworkgroup: C1[X(C6H8O3)]
method: RPBEPBE
basis: SDD
operation: Freq
keyword: #p
keyword: freq=noraman
keyword: PBEPBE/SDD
title: #p freq=noraman PBEPBE/SDD
converged: YES YES NO NO
title: Mulliken charges:
elementType: O O O C C C C C C H H H H H H H H
charge: -0.199110 -0.429962 -0.240334 0.308604 0.148337 -0.784715 -0.360593 -0.777585 0.159441 0.282405 0.249654 0.249459 0.260480 0.243451 0.263959 0.243373 0.383137
chargesum: 0.00000
title: Mulliken charges with hydrogens summed into heavy atoms:
elementType: O O O C C C C C C
charge: -0.199110 -0.046825 -0.240334 0.308604 0.148337 -0.003196 -0.100113 -0.026803 0.159441
polarizability: 1.11796049e+02 1.07454235e+01 8.09601254e+01 -2.20832517e-04 -1.11963174e-02 4.14562416e+01
1716.lowfreq: -0.0006 0.0005 0.0006 6.2157 6.6125 10.2723 45.2733 69.7935 91.2641
frequency: 45.2379 69.7844 91.0764 143.2468 158.3749 159.3280 269.2516 337.3447 376.5050 391.0650 435.8222 560.1919 593.1109 611.9001 615.2604 700.0621 774.1374 885.7702 899.1858 935.3252 1002.7119 1012.5829 1051.6958 1062.8061 1124.3054 1229.0551 1277.4858 1365.1968 1382.5134 1399.7438 1448.6567 1450.6649 1462.8053 1467.4115 1590.5653 1636.2716 1643.9962 2990.4502 2995.1601 3064.9274 3076.3093 3126.5071 3144.5210 3166.5890 3523.6789
redmass: 5.6295 4.1864 1.1154 2.3985 1.5280 2.6766 4.9502 3.4700 7.9390 3.2167 3.2996 4.4029 1.5013 1.6026 4.1724 3.5157 3.7115 5.2278 1.5417 2.2247 2.1550 1.4813 1.7508 1.8729 2.1013 1.9223 2.9364 1.3614 1.3937 1.3434 1.1122 1.0994 1.0489 1.0473 7.8729 7.8352 6.3779 1.0374 1.0391 1.0944 1.0971 1.0994 1.0995 1.0899 1.0641
irintensity: 1.5377 6.1106 0.0528 0.0001 0.9485 1.1037 6.7270 1.6599 10.8032 0.6283 5.0186 35.8842 89.4910 54.7966 9.0784 33.7335 1.7137 1.3980 31.7875 16.6445 249.8320 1.8035 0.0680 186.2461 36.4864 77.0989 107.3445 14.5509 72.8013 24.7194 52.9304 7.1598 33.9158 5.5189 125.4956 176.2868 56.1440 2.2596 2.8026 7.7797 9.5113 11.3533 2.8065 2.3397 49.5351
temp: 298.150 k
press: 1.00000 atm
elementType: 8 8 8 6 6 6 6 6 6 1 1 1 1 1 1 1 1
symmnumber: 1
zpe: 339432.0 jmol-1
zpe.correction: 0.129283 hartree
zpe.thermalcorrener: 0.139426 hartree
zpe.thermalcorrenthalpy: 0.140371 hartree
zpe.thermalcorrgfe: 0.092992 hartree
zpe.sumelectzpe: -458.412363 hartree
zpe.sumelectthermal: -458.402219 hartree
zpe.sumelectthermalent: -458.401275 hartree
zpe.sumelectthermalfe: -458.448654 hartree
dipole: -1.2651 -2.6144 0.0092
dipole: 2.9044
quadrupole: -57.3241 -53.1447 -52.3936
quadrupole: -0.6841 0.0067 0.0198
quadrupole: -3.0366 1.1428 1.8939 -0.6841 0.0067 0.0198
hfenergy: -458.5416455 hartree
pointgroup: C01 [X(C6H8O3)]
dipole: 0.4885243 -1.0312534 -0.0595031 debye
dipolederiv: -0.8566721 0.1602358 -0.0120941 0.1237595 -0.6469938 -0.0215392 -0.0152826 -0.0196905 -0.2983539 -0.8121665 0.6028401 0.0296405 0.5837118 -0.9099064 -0.010295 0.0284578 -0.0095598 -0.4382112 -0.8399991 -0.1946818 -0.03866 -0.1342507 -0.8392932 -0.0465683 -0.0336575 -0.0492579 -0.319666 -0.2798647 -0.0840427 -0.0192373 -0.4599582 0.3834221 0.0060809 -0.0479257 0.0234168 0.0163193 1.2967505 -0.056289 0.0475671 0.2724376 0.888854 0.072157 0.0727239 0.0572549 0.1169608 -0.1517485 0.0590665 -0.0034304 0.0960419 -0.3380838 -0.0224804 0.0004903 -0.0244671 0.0206683 -0.6887922 0.1849634 -0.0102609 0.0614448 -0.1161341 0.0054128 -0.0199929 0.0106653 -0.1512469 -0.0651624 -0.0739365 -0.0100775 -0.1694543 -0.4780978 -0.0472768 -0.0176264 -0.0432228 0.0359798 1.8130548 -0.3893765 0.0401978 -0.186664 1.3435976 0.0763802 0.054927 0.0672264 0.2586081 0.0309687 -0.1107253 -0.0115653 -0.030562 0.1015981 -0.0025899 -0.0058327 -0.0060935 0.118273 0.0978864 0.0101324 0.0960882 0.0185996 0.0833963 -0.0228726 0.0783231 -0.0499933 -0.0060841 0.1116142 0.0188329 -0.0844491 0.0265242 0.0705346 0.0372988 -0.0657418 0.0639262 -0.0074295 0.0898586 -0.0092861 -0.0038464 -0.0623784 -0.0374401 -0.0174545 -0.0072236 -0.0150656 0.158671 0.0524198 0.0305424 0.1054848 0.0136446 0.0791075 -0.0257055 0.0783689 -0.0501709 -0.0129449 -0.0876587 -0.0718108 -0.0146126 -0.0114404 0.0844371 -0.0035511 -0.0099879 -0.0061948 0.1238619 0.0674287 0.0411125 -0.0938117 0.0222464 0.0651435 0.0406622 -0.0692436 0.0666645 -0.0135943 0.2220825 -0.1175772 -0.0169332 -0.1637024 0.2658585 -0.0176587 -0.0207761 -0.0154379 0.3981885 unknown
polarizability: 111.4712995|-11.2006756|80.9958636|2.2698508|2.4885284|41.7452528 unknown
InChI: InChI=1S/C6H8O3/c1-4(5(2)7)3-6(8)9/h3,8H,1-2H3
charge 0 multiplicity 1
17 atoms
O  -2.881541 0.620242 -0.035415
O  2.776464 -1.311206 0.066752
O  2.531995 0.993988 0.233637
C  -0.494509 0.374992 0.048736
C  -1.905154 -0.183032 -0.054393
C  -0.399651 1.875844 0.163453
C  0.565552 -0.498135 0.031312
C  -2.136668 -1.685813 -0.179366
C  1.997223 -0.137095 0.122527
H  0.64138 2.217439 0.232613
H  -0.969953 2.218578 1.04641
H  -0.895618 2.347498 -0.704811
H  0.393965 -1.575164 -0.056336
H  -1.652147 -2.093345 -1.085598
H  -3.219893 -1.869279 -0.239827
H  -1.728341 -2.230594 0.691537
H  3.738495 -1.062818 0.128565
