program: Gaussian 09
title: 000292910
version: EM64L-G09RevD.01
frameworkgroup: C1[X(C16H13ClO)]
method: RPBEPBE
basis: SDD
operation: Freq
keyword: #p
keyword: freq=noraman
keyword: PBEPBE/SDD
title: #p freq=noraman PBEPBE/SDD
converged: YES YES NO NO
title: Mulliken charges:
elementType: Cl O C C C C C C C C C C C C C C C C H H H H H H H H H H H H H
charge: -0.047843 -0.251398 0.482437 0.432605 -0.371312 -0.384476 -0.383838 -0.400446 0.306872 -0.272369 0.099049 -0.312315 -0.804997 -0.327986 -0.340615 -0.229143 -0.223103 -0.103490 0.224396 0.238054 0.232952 0.235149 0.270270 0.205862 0.228873 0.240687 0.228914 0.223983 0.286906 0.256715 0.259606
chargesum: 0.00000
title: Mulliken charges with hydrogens summed into heavy atoms:
elementType: Cl O C C C C C C C C C C C C C C C C
charge: -0.047843 -0.251398 0.482437 0.432605 -0.146916 -0.146422 -0.150887 -0.165297 0.306872 -0.002099 0.099049 -0.106452 -0.106522 -0.104003 -0.053709 0.027573 0.036503 -0.103490
polarizability: 4.20042224e+02 5.22884751e+00 1.86764388e+02 -1.39504337e+00 -1.05280222e-01 7.45195115e+01
1716.lowfreq: -9.1396 -7.3365 0.0010 0.0011 0.0012 2.0383 3.3129 13.3870 27.0938
frequency: -8.0333 12.0789 27.0894 42.7759 66.3319 82.2836 133.2087 145.3646 187.8626 191.5700 242.9360 270.1386 308.6486 328.7502 347.5127 379.7733 405.5946 407.7756 471.5359 488.2047 500.5498 506.5298 533.2334 622.8477 637.5722 666.2626 686.0580 718.8372 742.9784 749.0294 808.2567 821.3530 828.7767 843.8806 855.1921 881.3141 887.6413 953.9175 960.8103 978.7659 987.7463 996.0005 998.0685 1010.3123 1016.7548 1031.3723 1046.3454 1072.7197 1109.0396 1125.3718 1182.0121 1194.4109 1216.2501 1223.2997 1232.1813 1286.2575 1305.3198 1324.3829 1332.9800 1370.8882 1377.6422 1396.7020 1398.3138 1417.8647 1468.4569 1472.1364 1474.1760 1508.2993 1513.4663 1568.9730 1580.1419 1593.2657 1618.7244 1634.5238 2975.8548 3057.4721 3089.1694 3095.1357 3121.0698 3122.1497 3142.5461 3145.3277 3149.9515 3154.9489 3157.6944 3173.2001 3176.9902
redmass: 1.5110 1.9219 3.3753 6.2824 5.1009 7.5955 3.6644 6.0361 7.4194 3.2472 6.8411 5.6972 8.0762 3.4371 3.3058 4.4142 2.8265 2.8147 3.2047 5.4759 6.7547 2.5858 5.1190 7.1530 6.8577 3.8945 7.0248 3.0063 2.7322 4.8580 5.9135 1.3651 1.4711 1.2976 1.5033 4.3826 1.9387 1.3806 1.3282 1.3808 1.4160 4.4183 1.3605 2.9014 1.2423 3.4078 1.5860 2.7527 1.3699 1.3538 1.1558 1.1437 2.8293 1.5918 2.5340 1.2988 1.8642 1.4596 1.7638 4.4394 4.3479 3.9498 1.2292 3.3130 1.1214 1.0714 2.2558 2.7276 9.7022 5.6233 7.5977 6.1983 6.1502 5.6482 1.0393 1.0942 1.0999 1.0892 1.0873 1.0876 1.0957 1.0916 1.0958 1.0887 1.0876 1.0961 1.0972
irintensity: 0.2738 0.2724 0.2164 0.0544 0.0420 2.8983 0.0466 1.5237 0.6282 2.2034 3.3226 0.6976 0.8975 4.1497 0.7038 19.2723 0.0258 0.0816 4.9570 1.3900 39.0891 35.8656 4.1979 2.6461 0.3586 6.0250 3.3411 1.2898 3.9117 27.8889 12.1290 81.0501 30.8797 5.6289 20.7982 8.7974 2.0458 0.7755 1.0105 0.2729 0.9321 96.0560 0.8410 1.4565 42.0117 73.9804 24.0981 75.1525 18.2674 13.8359 87.6770 30.1191 178.5107 36.9586 4.2173 2.3506 72.6990 90.3478 48.1724 3.2888 85.9937 13.1248 16.1929 16.5810 15.9696 16.0211 23.3825 90.1777 206.4514 25.3471 52.3438 234.3344 128.9663 255.2782 32.6483 22.4683 16.7445 0.7972 2.1279 24.7052 23.7106 15.5573 4.7577 0.6393 14.9731 11.5355 3.7572
temp: 298.150 k
press: 1.00000 atm
elementType: 17 8 6 6 6 6 6 6 6 6 6 6 6 6 6 6 6 6 1 1 1 1 1 1 1 1 1 1 1 1 1
symmnumber: 1
zpe: 624266.2 jmol-1
zpe.correction: 0.237770 hartree
zpe.thermalcorrener: 0.253421 hartree
zpe.thermalcorrenthalpy: 0.254365 hartree
zpe.thermalcorrgfe: 0.191413 hartree
zpe.sumelectzpe: -1151.531880 hartree
zpe.sumelectthermal: -1151.516230 hartree
zpe.sumelectthermalent: -1151.515286 hartree
zpe.sumelectthermalfe: -1151.578237 hartree
dipole: -4.1574 -2.8600 0.0585
dipole: 5.0465
quadrupole: -95.2259 -108.7104 -118.1855
quadrupole: 4.9920 -0.6362 -0.0826
quadrupole: 12.1480 -1.3364 -10.8116 4.9920 -0.6362 -0.0826
hfenergy: -1151.7696507 hartree
pointgroup: C01 [X(C16H13Cl1O1)]
dipole: 1.665495 1.0765189 -0.0956999 debye
polarizability: 420.0591481|-0.4158481|184.785739|5.9780129|-14.3440662|76.4812366 unknown
InChI: InChI=1S/C16H13ClO/c1-12-2-4-13(5-3-12)6-11-16(18)14-7-9-15(17)10-8-14/h2-11H,1H3
charge 0 multiplicity 1
31 atoms
Cl -6.743024 1.504242 -0.245009
O  -1.180849 -2.396421 0.336425
C  2.598298 -0.357285 0.114393
C  5.261566 0.725581 -0.002156
C  2.817382 1.036598 -0.097191
C  3.743625 -1.192415 0.262041
C  4.119764 1.561353 -0.155045
C  5.046929 -0.661976 0.203503
C  -2.532432 -0.424313 0.056044
C  1.268826 -0.967467 0.182534
C  -1.203785 -1.130041 0.165647
C  0.050565 -0.345125 0.072628
C  6.661821 1.307655 -0.034076
C  -2.676481 0.980761 -0.103352
C  -3.706229 -1.224715 0.121512
C  -3.954023 1.573882 -0.195224
C  -4.98809 -0.651429 0.030794
C  -5.091502 0.746396 -0.127208
H  1.963372 1.711529 -0.221948
H  3.599461 -2.268211 0.420344
H  4.263632 2.635738 -0.32235
H  5.909567 -1.329097 0.317202
H  1.2331 -2.055947 0.341567
H  -0.010954 0.735682 -0.086886
H  7.407886 0.555417 -0.343569
H  6.959814 1.673451 0.968193
H  6.729511 2.165091 -0.72673
H  -1.801973 1.635684 -0.155014
H  -3.580625 -2.30511 0.245823
H  -4.062918 2.655387 -0.316132
H  -5.887633 -1.271293 0.081139
