program: Gaussian 09
title: 000292992
version: EM64L-G09RevD.01
frameworkgroup: C1[X(C26H21BrO9)]
method: RPBEPBE
basis: SDD
operation: Freq
keyword: #p
keyword: freq=noraman
keyword: PBEPBE/SDD
title: #p freq=noraman PBEPBE/SDD
converged: YES YES NO NO
title: Mulliken charges:
elementType: Br O O O O O O O O O C C C C C C C C C C C C C C C C C C C C C C C C C C H H H H H H H H H H H H H H H H H H H H H
charge: 0.015923 -0.264196 -0.260340 -0.426393 -0.235371 -0.234595 -0.287604 -0.184012 -0.287464 -0.181099 -0.305872 -0.346815 0.368664 0.519054 0.368317 0.378220 -0.538940 -0.025112 -0.018018 0.213465 -0.366463 0.101293 0.108044 -0.429731 -0.435373 -0.400883 0.079621 0.081980 0.210953 0.213238 -0.326450 -0.340946 -0.489698 -0.489697 -0.535275 -0.535555 0.286251 0.268010 0.263768 0.285028 0.267775 0.258172 0.244550 0.247890 0.357292 0.232898 0.233801 0.237113 0.237582 0.232803 0.233728 0.227395 0.246223 0.225881 0.227371 0.227782 0.245815
chargesum: 0.00000
title: Mulliken charges with hydrogens summed into heavy atoms:
elementType: Br O O O O O O O O O C C C C C C C C C C C C C C C C C C C C C C C C C C
charge: 0.015923 -0.264196 -0.260340 -0.069102 -0.235371 -0.234595 -0.287604 -0.184012 -0.287464 -0.181099 -0.019621 -0.078804 0.368664 0.519054 0.368317 0.378220 -0.275172 -0.025112 -0.018018 0.213465 -0.081435 0.101293 0.108044 -0.161956 -0.177200 -0.400883 0.079621 0.081980 0.210953 0.213238 -0.081900 -0.093056 0.214114 0.214416 0.164224 0.165413
polarizability: 4.53221011e+02 5.27745382e+00 3.59522704e+02 -1.66687874e+01 2.13957316e+01 2.38495722e+02
1716.lowfreq: -45.4578 -43.6663 -0.4706 -0.0005 0.0006 0.0008 2.4617 4.3766 8.0473
frequency: -45.4577 -43.6624 7.8960 14.7360 23.1887 26.8480 29.4705 42.4722 65.0205 69.5253 81.4703 85.5449 104.5075 118.2405 122.9288 129.6869 142.0758 161.1294 180.1817 185.0205 186.2475 188.5906 198.4617 204.3079 213.1173 222.8988 237.9437 248.0774 255.4264 258.2855 267.1566 273.1722 299.9211 301.8653 323.2719 330.3308 334.0838 343.0060 348.8819 373.5794 417.2453 419.6217 450.6449 455.2789 461.3413 488.4958 490.4811 502.2865 524.5068 529.8409 548.1525 570.2004 572.5527 575.0404 584.6988 621.8624 631.7466 650.7460 654.8830 667.0203 684.2625 684.6432 689.1243 698.8224 727.5945 743.7103 749.4861 773.5439 787.8532 790.8202 808.2745 813.4197 815.4168 817.1683 839.4582 887.0715 905.3817 914.2115 922.4483 928.1193 929.9849 938.7941 941.6735 954.2069 967.0225 993.2492 1051.5060 1054.7091 1055.6930 1058.9900 1090.3112 1106.0537 1106.6500 1112.2959 1112.7748 1144.4609 1144.8355 1147.8542 1148.4128 1174.4954 1179.8737 1183.6577 1204.0593 1205.3187 1214.0311 1220.7640 1222.5258 1233.3527 1249.4886 1251.6875 1267.8861 1269.3099 1281.0484 1289.4078 1314.3237 1378.6879 1380.0882 1391.6080 1412.5488 1414.2639 1418.9721 1436.6670 1437.0525 1448.9843 1449.0863 1459.1714 1459.4663 1460.0913 1460.7787 1465.4909 1468.6777 1469.7602 1471.5409 1472.0841 1486.0925 1486.4092 1584.5848 1601.6501 1602.1132 1607.0432 1608.9219 1616.2721 1708.8668 1711.3852 2962.2069 2962.8354 2994.7988 3006.3956 3006.6964 3023.4011 3051.6276 3052.5301 3117.3715 3117.5374 3125.6712 3126.3820 3134.2595 3134.5573 3150.5782 3153.3500 3157.5881 3172.4577 3179.2037 3180.1606 3474.0412
redmass: 2.9999 3.0246 6.5567 6.3453 7.9501 6.7511 6.0221 5.4207 4.4048 4.7910 7.3311 7.7754 7.3524 4.9401 4.7414 9.6815 8.5370 5.9502 6.0086 1.3603 2.4081 1.4688 3.6429 3.2953 3.4298 4.5786 5.0789 6.5096 1.3670 1.4726 6.1491 5.3628 4.6225 4.2943 4.6281 4.7756 4.3854 4.7973 4.7602 6.1234 6.6393 6.9274 1.8307 1.9276 6.3332 5.6071 5.2013 5.8838 5.5149 5.8159 5.6860 8.0077 6.4104 5.1046 6.1950 6.7543 6.1243 5.4582 4.8539 5.8090 7.7305 7.6579 7.7888 7.9109 6.3981 5.0227 5.6030 6.4425 5.5037 4.1220 2.0819 4.5383 2.2758 4.0054 3.9339 3.1179 2.2942 3.4165 3.2990 1.7593 1.4826 1.6332 6.8403 6.9266 8.0498 5.5948 5.9183 5.3940 4.6323 3.8868 2.6877 1.2390 1.2392 1.2562 1.2564 1.4803 1.4858 1.3500 1.3483 1.4240 1.4634 1.5068 2.3860 2.8136 1.8578 1.9173 1.8630 1.6927 1.7160 1.7265 4.1239 3.5707 1.7116 3.7793 1.4186 4.6148 4.6326 5.2365 3.7747 3.4696 3.5462 1.2418 1.2594 1.4194 1.3942 1.0586 1.0627 1.0533 1.0550 3.7221 1.0496 1.0538 1.3411 1.3238 1.9442 1.9851 7.1795 7.8823 7.9033 8.3549 8.5181 7.1670 12.9838 12.9857 1.0328 1.0328 1.0840 1.0283 1.0282 1.0841 1.1042 1.1043 1.1053 1.1053 1.0996 1.0997 1.1056 1.1056 1.0909 1.0888 1.0875 1.0956 1.0963 1.0925 1.0648
irintensity: 8.4752 9.5628 2.7884 1.8324 0.6934 1.5057 4.2357 1.3886 0.5961 0.2905 1.6472 0.7529 0.5470 4.9391 1.6908 0.3221 0.0838 0.9300 0.4988 0.7091 1.6983 0.3605 6.7285 0.2341 1.6620 0.3519 1.2123 0.7313 0.0847 0.5028 8.2983 0.2314 9.5378 4.3137 1.4503 3.0812 4.4164 0.4053 3.0916 2.9993 0.8664 0.9114 45.1438 76.0866 0.6946 0.9579 0.6328 6.1193 11.1182 3.1936 2.9536 4.8336 2.1626 6.2316 14.5518 33.4919 8.7274 2.8349 28.7721 35.9610 1.7694 1.0839 6.6032 10.6639 4.8576 20.9693 20.6431 28.1491 17.8579 15.1842 21.2256 103.6853 23.6260 62.1500 24.3852 108.6402 7.9135 5.3384 90.6793 53.1349 14.0273 15.2335 83.6283 281.8028 16.9223 76.9474 18.9228 11.0561 89.1478 82.2583 78.8580 0.0154 0.0154 0.0336 0.0386 16.7595 5.9610 2.4092 2.4509 25.7395 6.8208 27.7223 34.7917 153.9216 12.8141 156.3321 74.0310 120.6343 14.2247 51.2143 64.3479 394.5830 85.2473 88.8362 11.9166 211.2313 146.4019 3.1521 14.1203 4.6730 12.9278 9.5323 10.1871 3.1003 2.0625 44.5223 35.1061 14.4556 24.9176 176.9540 12.4916 14.7841 180.5356 112.2416 175.8749 38.4122 14.7327 40.9486 21.8644 22.0794 14.3594 1.2956 421.7077 374.1219 66.7736 59.0471 9.9207 82.0083 59.3416 2.4069 40.4533 39.2956 30.4957 32.5756 22.7404 22.6062 18.6297 18.8293 5.1568 2.6361 6.7207 6.3492 4.5996 1.6595 75.4738
temp: 298.150 k
press: 1.00000 atm
elementType: 35 8 8 8 8 8 8 8 8 8 6 6 6 6 6 6 6 6 6 6 6 6 6 6 6 6 6 6 6 6 6 6 6 6 6 6 1 1 1 1 1 1 1 1 1 1 1 1 1 1 1 1 1 1 1 1 1
symmnumber: 1
zpe: 1090209.3 jmol-1
zpe.correction: 0.415239 hartree
zpe.thermalcorrener: 0.447714 hartree
zpe.thermalcorrenthalpy: 0.448658 hartree
zpe.thermalcorrgfe: 0.347728 hartree
zpe.sumelectzpe: -1691.214921 hartree
zpe.sumelectthermal: -1691.182446 hartree
zpe.sumelectthermalent: -1691.181502 hartree
zpe.sumelectthermalfe: -1691.282431 hartree
dipole: -3.5251 0.1435 -2.8845
dipole: 4.5571
quadrupole: -137.4399 -212.0784 -225.2296
quadrupole: -39.1617 -48.2246 -9.7639
quadrupole: 54.1427 -20.4958 -33.6470 -39.1617 -48.2246 -9.7639
hfenergy: -1691.6301593 hartree
pointgroup: C01 [X(C26H21Br1O9)]
dipole: -0.5699824 -1.6373053 -0.4570604 debye
polarizability: 364.4637569|9.6750385|401.2318138|-38.9761308|-85.1217812|285.543866 unknown
InChI: InChI=1S/C26H21BrO9/c1-31-16-7-5-12-18(23(16)33-3)25(29)35-21(12)11-9-14(20(28)15(27)10-11)22-13-6-8-17(32-2)24(34-4)19(13)26(30)36-22/h5-10,21-22,28H,1-4H3
charge 0 multiplicity 1
57 atoms
Br -4.15929 1.662642 -1.15913
O  0.68709 -2.811434 -0.480457
O  0.495742 3.468725 1.136175
O  -3.2132 -1.35719 -1.085704
O  1.007738 -5.37511 2.989013
O  2.784967 6.009821 -1.514249
O  -1.556572 -5.669211 4.359054
O  2.304098 -4.054342 0.651243
O  4.414195 4.447543 -3.372353
O  0.833965 5.740817 0.722084
C  -0.762839 -2.511533 -0.353398
C  1.002952 2.169999 0.62738
C  -0.970198 -1.003075 -0.279823
C  -0.148983 1.265327 0.209335
C  -1.192794 -3.282396 0.890895
C  1.95132 2.559478 -0.505039
C  0.04667 -0.134072 0.161407
C  -0.074957 -3.964375 1.423166
C  2.012349 3.968432 -0.592948
C  -2.221445 -0.459767 -0.669495
C  -1.394522 1.810909 -0.176862
C  1.121095 -3.691352 0.58736
C  1.113305 4.571976 0.423701
C  -2.452579 -3.375664 1.491059
C  2.692306 1.746149 -1.368243
C  -2.408141 0.942558 -0.610281
C  -0.168766 -4.771995 2.587986
C  2.828559 4.629594 -1.549114
C  -1.464561 -4.865919 3.205177
C  3.597514 3.791652 -2.430518
C  -2.570979 -4.175768 2.652196
C  3.514484 2.381549 -2.328916
C  1.125041 -6.25886 4.166545
C  3.545923 6.886327 -2.427742
C  -2.863713 -5.78374 5.00876
C  5.211177 3.61776 -4.278583
H  -1.265451 -2.906384 -1.255162
H  1.563152 1.695421 1.456513
H  1.009069 -0.570581 0.448435
H  -1.56015 2.889191 -0.115042
H  -3.317093 -2.852294 1.075355
H  2.641663 0.654551 -1.320496
H  -3.549021 -4.260348 3.134675
H  4.100821 1.759461 -3.011151
H  -4.01712 -0.858067 -1.393645
H  0.485133 -7.149253 4.059418
H  0.863342 -5.723055 5.092782
H  2.188323 -6.542015 4.167471
H  3.255704 7.898791 -2.109344
H  3.259427 6.710837 -3.476966
H  4.630735 6.73612 -2.309145
H  -3.226361 -4.79877 5.361267
H  -2.695561 -6.446026 5.870671
H  -3.612119 -6.237744 4.330667
H  4.565479 2.982823 -4.915535
H  5.925727 2.98312 -3.719551
H  5.763151 4.332264 -4.906698
