program: Gaussian 09
title: 000002543
version: EM64L-G09RevD.01
frameworkgroup: C1[X(C21H26O2)]
method: RPBEPBE
basis: SDD
operation: Freq
keyword: #pfreq=noraman
keyword: PBEPBE/SDD
title: #p freq=noraman PBEPBE/SDD
converged: YES YES NO NO
title: Mulliken charges:
elementType: O O C C C C C C C C C C C C C C C C C C C C C H H H H H H H H H H H H H H H H H H H H H H H H H H
charge: -0.285541 -0.470040 0.128024 0.290922 0.262018 0.019549 0.197966 -0.737507 -0.715825 0.608805 -0.580414 -0.635505 -0.398946 0.229279 -0.536601 -0.398005 -0.678498 0.472084 -0.351661 -0.458612 -0.357122 -0.823129 -0.690827 0.200453 0.241307 0.237802 0.244937 0.222903 0.228795 0.222043 0.196860 0.260191 0.229596 0.297127 0.206516 0.213966 0.218610 0.184697 0.198073 0.229902 0.208453 0.194157 0.219510 0.228230 0.233768 0.359034 0.208105 0.215849 0.208701
chargesum: 0.00000
title: Mulliken charges with hydrogens summed into heavy atoms:
elementType: O O C C C C C C C C C C C C C C C C C C C C C
charge: -0.285541 -0.111006 0.128024 0.290922 0.262018 0.019549 0.197966 -0.057945 -0.019189 0.608805 -0.161512 -0.375315 -0.169350 0.229279 -0.239474 0.022477 -0.459888 0.472084 0.031110 -0.228710 0.045488 -0.141621 -0.058172
polarizability: 3.62945128e+02 1.35082439e+00 2.45591770e+02 3.18127703e+00 -3.17769462e+00 1.42520248e+02
1716.lowfreq: -6.8597 -3.7097 -0.0011 -0.0004 0.0009 7.1649 10.7969 21.5780 25.3152
frequency: 10.4912 21.4179 25.1861 35.5792 58.2413 74.5401 82.3078 94.7428 110.8640 139.8906 167.3960 200.0676 209.7061 215.6301 223.8586 228.0877 242.8675 250.9806 253.8205 272.4033 289.5144 302.8016 309.2243 336.3423 348.6236 366.5433 375.4167 398.6467 431.7480 468.6388 472.0929 492.5625 515.6558 532.7902 550.9161 575.9420 591.2073 603.1822 646.4053 660.4987 676.3725 701.8091 724.4381 735.6063 764.4501 778.3456 812.4393 817.1372 822.8300 838.6609 856.0318 860.2937 875.4324 908.8029 919.2659 932.1439 954.6883 955.7896 968.7295 989.3254 992.5537 999.8873 1003.9272 1029.5790 1035.6296 1049.2900 1085.2091 1096.4054 1099.1251 1109.2921 1119.4591 1150.3257 1155.7664 1176.1286 1185.0589 1200.7160 1206.2471 1224.7659 1236.9751 1266.9055 1275.7733 1280.9955 1284.5900 1295.0663 1306.1147 1307.7221 1318.6455 1340.4399 1354.8025 1366.9161 1374.9282 1381.2571 1388.3814 1391.8855 1396.0180 1402.2798 1423.8087 1454.6849 1459.8089 1461.2554 1465.3782 1471.3204 1473.5617 1474.1472 1475.4648 1477.8313 1480.6263 1482.9365 1487.0895 1492.3927 1504.9763 1574.1945 1585.8325 1616.8242 1625.7867 2953.8635 2969.9784 2971.2674 2972.1932 2974.0284 2980.2898 2986.5587 3000.9132 3001.6557 3018.6197 3032.3989 3050.6513 3054.9166 3068.6367 3071.7672 3082.3796 3087.4205 3091.9048 3098.4996 3100.5727 3108.0149 3121.7151 3149.8180 3155.1328 3183.4957 3572.7483
redmass: 1.0168 4.0485 4.1999 2.3750 4.0047 2.1715 3.0754 3.2243 3.8011 3.8276 3.2912 1.2708 2.7873 2.0673 2.4255 1.8558 1.5418 1.1294 2.6671 3.0171 3.3981 3.2599 3.1352 3.6317 2.5968 2.6459 1.8796 3.2671 3.5421 3.3493 3.7527 3.7555 4.4644 4.8983 5.0977 3.7235 4.6054 3.5151 4.6691 3.9763 4.3597 4.0050 2.3878 1.4824 1.2762 4.0471 2.4459 2.0608 1.4849 1.4920 1.8107 3.9527 1.5245 2.0916 1.4067 1.6457 1.3813 1.7172 1.7453 1.8875 2.4834 1.3518 3.7524 3.0772 3.2780 1.5620 2.0412 2.6259 1.6378 1.9726 1.9345 1.9135 1.6595 1.3011 1.5274 2.8678 1.9964 1.6617 1.3427 1.2967 1.3971 1.7985 2.4483 1.1888 1.2146 2.0619 4.3762 1.5143 1.5086 5.9316 1.2656 4.1881 1.2128 1.2759 1.2679 3.2799 3.5952 1.0715 1.0770 1.0517 1.0839 1.0728 1.0640 1.0836 1.0868 1.0426 1.1727 1.0941 1.0856 2.2617 4.1669 5.6058 6.8749 6.5772 7.4763 1.0599 1.0561 1.0523 1.0492 1.0381 1.0619 1.0347 1.0354 1.0958 1.0994 1.1015 1.1032 1.0956 1.1008 1.0994 1.0997 1.1003 1.1002 1.0910 1.0991 1.1009 1.0878 1.0951 1.0920 1.0914 1.0657
irintensity: 0.4636 0.0192 0.1612 0.0714 0.4536 0.5656 0.0591 1.7618 0.3066 2.3098 0.8066 0.4684 0.4288 0.3524 0.1637 0.6844 0.0966 0.7727 0.9525 1.2742 3.6444 0.4885 0.8270 3.0215 34.6967 16.1147 54.5890 3.2948 2.1732 0.1469 2.1043 1.4561 10.2890 1.7411 2.4911 8.1276 2.8440 12.4604 6.0919 8.2638 6.4645 1.4125 12.1268 3.5047 5.3482 1.6388 14.8559 24.3683 33.1183 4.1689 0.3846 12.1478 23.2162 0.6320 7.7473 2.6885 1.3169 11.1327 43.8338 4.4711 7.4137 5.5077 101.9603 34.2267 9.9618 18.1735 7.1717 3.5034 10.7601 13.8880 60.6651 29.4475 19.9724 27.2462 5.6473 39.9454 6.3075 44.9678 5.7387 2.1510 7.2313 0.9359 28.0758 0.5747 1.2032 18.8496 24.3553 1.3695 2.2352 4.5918 27.3199 7.9622 12.1254 22.3275 5.9879 60.8931 22.5845 4.7744 2.4246 4.0106 3.4383 16.8738 4.2312 12.0377 20.3845 13.0718 4.5280 12.2361 9.1688 35.3475 13.4273 9.4468 72.0186 107.6450 76.0919 23.9905 23.7669 85.3716 11.2252 44.0566 52.3968 15.9132 18.4623 12.4228 6.9344 37.4532 48.5883 23.0353 84.0882 52.5402 19.8922 10.0616 21.1918 18.6617 30.1464 25.3128 11.2666 30.5676 4.7366 4.2361 25.4798
temp: 298.150 k
press: 1.00000 atm
elementType: 8 8 6 6 6 6 6 6 6 6 6 6 6 6 6 6 6 6 6 6 6 6 6 1 1 1 1 1 1 1 1 1 1 1 1 1 1 1 1 1 1 1 1 1 1 1 1 1 1
symmnumber: 1
zpe: 1084509.6 jmol-1
zpe.correction: 0.413068 hartree
zpe.thermalcorrener: 0.436669 hartree
zpe.thermalcorrenthalpy: 0.437613 hartree
zpe.thermalcorrgfe: 0.357854 hartree
zpe.sumelectzpe: -964.599058 hartree
zpe.sumelectthermal: -964.575457 hartree
zpe.sumelectthermalent: -964.574513 hartree
zpe.sumelectthermalfe: -964.654272 hartree
dipole: -0.9816 -1.1648 1.0969
dipole: 1.8771
quadrupole: -125.0892 -122.9920 -143.3262
quadrupole: 5.2806 0.1730 1.1417
quadrupole: 5.3799 7.4772 -12.8571 5.2806 0.1730 1.1417
hfenergy: -965.0121261 hartree
pointgroup: C01 [X(C21H26O2)]
dipole: 0.3919888 0.4478427 0.4372192 debye
polarizability: 362.95188|0.0559042|245.4687158|-3.4386505|4.6256256|142.6365513 unknown
InChI: InChI=1S/C21H26O2/c1-5-6-7-8-15-12-18(22)20-16-11-14(2)9-10-17(16)21(3,4)23-19(20)13-15/h9-13,22H,5-8H2,1-4H3
charge 0 multiplicity 1
49 atoms
O  -0.544968 -1.899444 -0.609796
O  -0.656362 2.856782 0.557044
C  -1.8196 -2.16586 0.156508
C  -2.74979 -0.960267 0.009432
C  -2.187133 0.357356 -0.003625
C  -0.710161 0.490709 -0.034491
C  0.065202 -0.658537 -0.387873
C  -2.340905 -3.458639 -0.487892
C  -1.441548 -2.389625 1.641734
C  2.165628 0.59524 -0.407504
C  3.677019 0.649157 -0.562519
C  1.459982 -0.613821 -0.589884
C  -4.150476 -1.11911 -0.033916
C  0.036827 1.689093 0.166904
C  -3.072086 1.469236 -0.053958
C  4.420129 0.307639 0.761923
C  1.436729 1.743642 -0.013952
C  -4.477405 1.310095 -0.089956
C  5.959566 0.430728 0.664484
C  -5.011133 -0.001169 -0.07841
C  6.624715 -0.580072 -0.300276
C  -5.388067 2.524699 -0.162232
C  8.166685 -0.507469 -0.263244
H  -3.195799 -3.868883 0.076406
H  -2.649934 -3.280101 -1.531218
H  -1.534521 -4.21144 -0.484704
H  -0.974448 -1.486442 2.071376
H  -2.347757 -2.617185 2.230709
H  -0.733882 -3.232919 1.73222
H  3.99358 -0.057971 -1.351833
H  3.990566 1.66062 -0.890046
H  1.975567 -1.534551 -0.879753
H  -4.58332 -2.124808 -0.022259
H  -2.647928 2.474928 -0.062058
H  4.147429 -0.721079 1.072732
H  4.046159 0.982783 1.557434
H  1.967397 2.692511 0.147878
H  6.228824 1.462238 0.352978
H  6.392887 0.28931 1.676185
H  -6.097529 -0.148525 -0.102682
H  6.276785 -0.398463 -1.336119
H  6.29384 -1.604924 -0.033702
H  -6.416981 2.278357 0.153842
H  -5.01897 3.344146 0.480145
H  -5.444211 2.919999 -1.195172
H  -0.013436 3.594894 0.701839
H  8.548756 -0.729473 0.751184
H  8.624504 -1.230499 -0.963146
H  8.522374 0.503014 -0.540641
