program: Gaussian 09
title: 000292906
version: EM64L-G09RevD.01
frameworkgroup: C1[X(C15H9Cl3O)]
method: RPBEPBE
basis: SDD
operation: Freq
keyword: #p
keyword: freq=noraman
keyword: PBEPBE/SDD
title: #p freq=noraman PBEPBE/SDD
converged: YES YES NO NO
title: Mulliken charges:
elementType: Cl Cl Cl O C C C C C C C C C C C C C C C H H H H H H H H H
charge: -0.046052 -0.025330 -0.042209 -0.238118 0.648749 0.307463 -0.215178 0.092849 -0.300824 -0.305887 -0.289965 -0.326302 -0.338449 -0.244023 -0.244990 -0.212941 -0.227433 -0.220902 -0.103813 0.278792 0.236715 0.231516 0.286696 0.265296 0.266846 0.247496 0.258950 0.261047
chargesum: 0.00000
title: Mulliken charges with hydrogens summed into heavy atoms:
elementType: Cl Cl Cl O C C C C C C C C C C C C C C C
charge: -0.046052 -0.025330 -0.042209 -0.238118 0.648749 0.307463 0.063615 0.092849 -0.300824 -0.305887 -0.053250 -0.094786 -0.051753 0.021272 0.021856 0.034556 0.031517 0.040146 -0.103813
polarizability: 3.87740517e+02 1.71802414e+00 2.08454490e+02 5.41910663e+00 -7.17315255e+00 7.59597638e+01
1716.lowfreq: -10.6221 -1.0344 0.0013 0.0015 0.0021 4.0820 8.4801 20.4040 35.8463
frequency: -3.3833 20.3806 35.8395 53.6404 71.0997 105.0792 118.6190 158.0620 170.7686 189.8372 228.3077 246.3913 266.2638 306.2532 309.1283 323.8831 370.1628 392.3314 405.5961 428.3041 471.1219 505.4038 517.3731 524.9270 546.0959 598.7938 622.6167 660.7029 700.5889 717.2030 725.6020 750.3707 780.3840 790.0783 825.5662 851.0476 884.9086 896.7718 900.6129 956.2643 970.5754 995.5259 996.2487 1011.3668 1024.8505 1044.6628 1073.0292 1074.8376 1111.6144 1147.2508 1176.3985 1188.5321 1217.0092 1244.1860 1290.9481 1306.9112 1338.1189 1362.0773 1372.7591 1398.4953 1415.8447 1426.2744 1476.1840 1519.8390 1549.8001 1578.6243 1586.2121 1594.3764 1636.5381 3110.3006 3154.6283 3156.2889 3156.5084 3174.5807 3176.1228 3178.0261 3187.1327 3209.4632
redmass: 5.6083 6.1964 9.4102 10.1935 5.8612 8.9943 5.7115 7.5980 6.5727 4.5253 15.2050 9.9710 5.4946 5.7878 6.7015 7.1096 9.0592 8.5799 2.8541 7.9435 3.3302 7.6457 3.5050 5.4086 5.0934 7.6614 7.1581 3.8472 7.3024 3.5344 7.7427 2.9631 1.4912 6.4603 1.3750 1.4849 4.0535 2.3778 1.3516 1.3881 1.3423 3.4875 1.5050 1.1626 3.6624 5.9625 2.7925 2.3439 1.3714 1.7351 1.2435 1.1874 2.7056 1.8155 1.3595 2.0216 1.7660 2.8056 4.1206 4.0086 2.4669 2.9258 2.3678 10.7655 6.2836 7.5257 7.5754 6.2232 5.7795 1.0873 1.0882 1.0887 1.0876 1.0963 1.0930 1.0975 1.0999 1.0901
irintensity: 0.2169 1.0737 0.3064 0.2787 2.8342 0.0519 1.2719 0.6087 0.8821 0.0418 0.0823 3.7858 1.9260 2.8819 1.8218 10.7233 11.6339 6.8310 0.1337 8.8647 14.3155 29.9179 4.7768 2.2123 3.1058 12.4787 1.5560 3.9711 1.7266 9.4927 68.3890 55.7463 41.7275 21.1865 9.3479 49.1944 8.3192 7.3551 0.0100 1.0014 0.9714 85.8854 13.2431 44.9595 49.6966 0.3540 59.9184 23.2221 17.5581 23.9284 42.8513 20.0702 117.6282 58.1062 32.3424 254.3229 24.5253 65.4014 23.1854 13.5625 65.5167 32.2300 12.6358 112.3010 36.9496 34.3341 34.5189 194.5289 160.8159 0.9666 6.3380 0.4406 1.9314 6.3099 0.6276 2.8343 7.1815 2.7950
temp: 298.150 k
press: 1.00000 atm
elementType: 17 17 17 8 6 6 6 6 6 6 6 6 6 6 6 6 6 6 6 1 1 1 1 1 1 1 1 1
symmnumber: 1
zpe: 502781.6 jmol-1
zpe.correction: 0.191499 hartree
zpe.thermalcorrener: 0.207801 hartree
zpe.thermalcorrenthalpy: 0.208745 hartree
zpe.thermalcorrgfe: 0.145009 hartree
zpe.sumelectzpe: -2031.071103 hartree
zpe.sumelectthermal: -2031.054801 hartree
zpe.sumelectthermalent: -2031.053857 hartree
zpe.sumelectthermalfe: -2031.117594 hartree
dipole: -3.3275 3.1093 -0.9184
dipole: 4.6458
quadrupole: -111.6253 -129.7415 -135.2563
quadrupole: -9.3862 2.5225 -0.3543
quadrupole: 13.9157 -4.2005 -9.7152 -9.3862 2.5225 -0.3543
hfenergy: -2031.2626022 hartree
pointgroup: C01 [X(C15H9Cl3O1)]
dipole: -1.4201027 0.8637248 -0.7603465 debye
polarizability: 384.1230874|26.8095605|191.8726431|10.5014513|-47.2394369|96.1590399 unknown
InChI: InChI=1S/C15H9Cl3O/c16-11-6-4-10(5-7-11)15(19)9-8-12-13(17)2-1-3-14(12)18/h1-9H
charge 0 multiplicity 1
28 atoms
Cl -1.865734 2.441049 -0.590224
Cl -3.488756 -2.891509 0.513802
Cl 6.719209 1.322356 -0.609099
O  1.008249 -1.861596 1.333411
C  -2.696489 -0.237071 -0.064844
C  2.444671 -0.245334 0.274391
C  -1.359572 -0.681344 0.349232
C  1.093251 -0.818802 0.604002
C  -3.07512 1.071957 -0.503915
C  -3.788283 -1.168249 -0.009076
C  -0.12833 -0.153724 0.065448
C  2.637132 0.962481 -0.451008
C  3.588779 -0.958985 0.727786
C  -4.389753 1.425901 -0.856955
C  -5.110908 -0.853216 -0.360441
C  -5.41263 0.456741 -0.788897
C  3.935279 1.445379 -0.720438
C  4.889973 -0.493852 0.464807
C  5.042921 0.707188 -0.259938
H  -1.338307 -1.59969 0.952453
H  -0.015149 0.726094 -0.566522
H  1.786441 1.549309 -0.809227
H  3.426427 -1.884068 1.290118
H  -4.607096 2.448363 -1.176231
H  -5.888164 -1.619114 -0.300471
H  -6.437556 0.72214 -1.064712
H  4.08288 2.376014 -1.27538
H  5.767236 -1.046918 0.811928
