program: Gaussian 09
title: 000292874
version: EM64L-G09RevD.01
frameworkgroup: C1[X(C15H10BrClO)]
method: RPBEPBE
basis: SDD
operation: Freq
keyword: #p
keyword: freq=noraman
keyword: PBEPBE/SDD
title: #p freq=noraman PBEPBE/SDD
converged: YES YES NO NO
title: Mulliken charges:
elementType: Br Cl O C C C C C C C C C C C C C C C H H H H H H H H H H
charge: 0.029918 -0.042525 -0.246285 0.307698 0.494065 0.100086 -0.271314 -0.304002 -0.325806 -0.338279 -0.365658 -0.379778 -0.227318 -0.221250 -0.190015 -0.194754 -0.104708 -0.219563 0.273118 0.206134 0.223073 0.287162 0.232862 0.247665 0.258138 0.261041 0.253842 0.256453
chargesum: 0.00000
title: Mulliken charges with hydrogens summed into heavy atoms:
elementType: Br Cl O C C C C C C C C C C C C C C C
charge: 0.029918 -0.042525 -0.246285 0.307698 0.494065 0.100086 0.001804 -0.097868 -0.102733 -0.051117 -0.132796 -0.132112 0.030819 0.039792 0.063827 0.061699 -0.104708 -0.219563
polarizability: 4.54929176e+02 1.36127411e+00 1.86588225e+02 -4.83670221e-01 -2.35242504e-01 6.79320727e+01
1716.lowfreq: -8.1757 -4.9832 -0.0020 -0.0013 -0.0011 2.3842 9.2224 23.1543 32.4284
frequency: 4.8596 23.1424 32.4120 51.4828 81.1827 126.9495 131.0015 154.7502 166.4407 214.2036 269.6257 273.7286 297.6768 328.1782 336.1001 391.1902 405.4919 407.9209 470.9281 495.6513 502.3364 521.1181 610.3043 623.0306 625.3882 664.3254 701.8093 714.3515 742.8346 786.2741 822.5170 827.3304 832.9531 855.2259 878.4121 890.6727 954.3810 960.7230 972.8762 993.5268 995.9814 997.9371 1017.8894 1026.8735 1062.1395 1073.6140 1108.6544 1114.6650 1182.9591 1191.7387 1217.7352 1224.1418 1285.9279 1297.9521 1313.7253 1332.0786 1369.4392 1374.9455 1397.8581 1401.5768 1472.5601 1477.2233 1515.1322 1564.1262 1579.4319 1592.4529 1595.4453 1636.8160 3098.7876 3138.0747 3142.5888 3147.1977 3155.7689 3158.1330 3171.1031 3173.6072 3174.5003 3177.4198
redmass: 3.7442 4.6980 11.8027 9.5084 7.6151 6.8361 4.6722 14.0360 4.0744 8.3257 5.6594 6.6979 8.5313 7.1290 4.0393 6.6530 2.8378 2.8363 3.2246 6.8560 2.7471 5.2819 7.4616 7.1357 7.0927 3.8856 7.3947 3.4280 2.8487 6.5160 1.3597 1.3043 1.4534 1.5530 4.3507 1.9719 1.3814 1.3558 1.3760 4.6562 4.4596 1.3596 1.2328 3.4846 2.7106 2.7447 1.3944 1.3997 1.1523 1.1164 3.2013 1.4327 1.3068 1.4287 2.0478 1.6265 4.1064 4.7184 4.1601 3.3078 2.3621 2.4368 10.5621 6.9463 7.5401 5.9863 6.2075 5.5826 1.0894 1.0900 1.0896 1.0892 1.0887 1.0875 1.0957 1.0962 1.0966 1.0973
irintensity: 0.0033 0.0156 0.0950 0.7653 3.2085 1.1548 0.4051 0.3086 0.6971 2.6687 0.7555 2.5570 5.2036 25.6773 0.2665 2.8866 0.0511 0.0174 3.4632 29.9849 43.5305 8.8885 0.1617 2.9175 0.6022 4.9316 6.7204 0.1860 4.0089 68.0833 55.6685 10.2522 69.9318 14.1142 2.0824 1.1129 1.2827 1.2973 0.2021 134.2772 47.1624 0.5584 42.2351 84.2137 56.7917 73.7488 9.1963 17.1528 75.2687 1.2792 197.8182 19.9275 1.2962 22.4470 177.9356 36.2704 7.8363 112.1793 5.6203 44.2367 135.8370 31.9403 195.9243 15.8458 56.1802 233.2555 60.8822 295.6403 0.5027 4.1778 3.7656 7.0362 0.6484 12.9133 7.7131 10.8115 3.5440 3.6383
temp: 298.150 k
press: 1.00000 atm
elementType: 35 17 8 6 6 6 6 6 6 6 6 6 6 6 6 6 6 6 1 1 1 1 1 1 1 1 1 1
symmnumber: 1
zpe: 526964.0 jmol-1
zpe.correction: 0.200710 hartree
zpe.thermalcorrener: 0.216873 hartree
zpe.thermalcorrenthalpy: 0.217817 hartree
zpe.thermalcorrgfe: 0.151446 hartree
zpe.sumelectzpe: -1125.090416 hartree
zpe.sumelectthermal: -1125.074253 hartree
zpe.sumelectthermalent: -1125.073309 hartree
zpe.sumelectthermalfe: -1125.139680 hartree
dipole: 1.2720 -1.6962 0.0000
dipole: 2.1202
quadrupole: -131.3356 -116.6824 -126.4830
quadrupole: 4.2404 -0.1433 -0.1080
quadrupole: -6.5020 8.1512 -1.6493 4.2404 -0.1433 -0.1080
hfenergy: -1125.2911258 hartree
pointgroup: C01 [X(C15H10Br1Cl1O1)]
dipole: 0.477735 0.6752241 -0.1078202 debye
polarizability: 454.700806|7.1581622|183.9649768|-3.7537385|-18.1362278|70.7836906 unknown
InChI: InChI=1S/C15H10BrClO/c16-13-6-1-11(2-7-13)3-10-15(18)12-4-8-14(17)9-5-12/h1-10H
charge 0 multiplicity 1
28 atoms
Br 7.06084 1.32024 -0.264238
Cl -6.707781 1.58503 -0.185301
O  -1.197078 -2.39239 0.370687
C  -2.525778 -0.406504 0.075134
C  2.605172 -0.421238 0.040931
C  -1.208516 -1.130513 0.174478
C  1.266384 -1.009141 0.144345
C  0.059303 -0.367124 0.043043
C  -2.64974 0.995974 -0.122571
C  -3.710892 -1.184617 0.190946
C  2.837915 0.965688 -0.1974
C  3.73837 -1.27339 0.184558
C  -3.918816 1.607853 -0.202639
C  -4.984392 -0.591893 0.113038
C  4.143695 1.481282 -0.287942
C  5.053791 -0.77399 0.096966
C  -5.068313 0.802634 -0.083611
C  5.242291 0.603722 -0.13913
H  1.21483 -2.093342 0.325127
H  0.011749 0.71133 -0.136044
H  -1.76641 1.63441 -0.214863
H  -3.601632 -2.263074 0.343747
H  1.994094 1.65354 -0.314818
H  3.584049 -2.343145 0.367742
H  -4.012645 2.686956 -0.353514
H  -5.892723 -1.194225 0.202517
H  4.309296 2.546607 -0.471222
H  5.911836 -1.442282 0.209734
