program: Gaussian 09
title: 000292872
version: EM64L-G09RevD.01
frameworkgroup: C1[X(C15H10ClNO2)]
method: RPBEPBE
basis: SDD
operation: Freq
keyword: #p
keyword: freq=noraman
keyword: PBEPBE/SDD
title: #p freq=noraman PBEPBE/SDD
converged: NO YES NO NO
title: Mulliken charges:
elementType: Cl O O N C C C C C C C C C C C C C C C H H H H H H H H H H
charge: -0.031158 -0.276909 -0.189297 -0.045731 0.131236 0.341760 0.050666 0.190601 0.090703 -0.305725 0.138059 -0.403828 -0.333807 -0.324728 -0.784635 -0.241709 -0.221645 -0.080769 -0.229049 0.286250 0.234533 0.287309 0.277295 0.244340 0.244783 0.214575 0.236771 0.233794 0.266316
chargesum: 0.00000
title: Mulliken charges with hydrogens summed into heavy atoms:
elementType: Cl O O N C C C C C C C C C C C C C C C
charge: -0.031158 -0.276909 -0.189297 -0.045731 0.131236 0.341760 0.050666 0.190601 0.090703 -0.019475 0.138059 -0.169295 -0.046498 -0.047433 -0.080938 -0.004937 0.012149 -0.080769 0.037266
polarizability: 3.47979115e+02 5.41240541e+00 2.07288730e+02 -8.52660173e-02 -8.30385888e-02 7.22003510e+01
1716.lowfreq: -6.6766 -0.0020 -0.0012 -0.0011 2.7265 5.1071 19.5640 54.8517 84.6239
frequency: 19.4960 54.8502 84.6231 87.7433 111.6124 145.8925 188.2843 189.6826 215.1367 247.9873 255.3663 277.5019 304.8134 311.2565 382.5295 424.1153 434.8769 452.0685 496.3482 497.2658 529.5966 564.6130 576.4950 588.5510 623.1868 656.0122 663.7235 682.4785 715.7718 736.0557 764.8439 789.6188 791.8348 839.1274 853.9905 884.8504 886.1794 894.6726 912.8800 974.8457 974.9058 977.9197 994.2306 1005.2539 1045.9177 1055.2899 1062.9013 1111.8335 1133.0832 1180.2285 1181.7051 1213.1027 1214.6233 1249.2381 1271.3876 1290.9291 1370.2222 1382.8345 1405.3352 1412.1075 1432.1485 1451.0171 1451.5096 1465.4635 1481.3840 1547.4606 1552.8438 1576.8844 1603.1496 1612.5553 1688.8874 2991.3167 3077.7843 3090.7555 3127.5433 3143.7475 3159.8710 3161.4302 3181.8596 3186.4109 3186.4909
redmass: 4.2581 5.2765 10.5778 6.9355 6.3561 4.8554 1.0762 8.6490 4.2786 6.5478 6.2119 9.6152 5.0183 5.3379 7.5804 3.3666 3.1763 3.2373 9.0967 3.5126 7.8824 7.3686 7.5060 5.6057 9.1997 4.7054 6.5231 5.8404 7.1947 1.9174 3.4483 1.8954 5.4774 1.5018 9.1716 7.1458 1.3066 1.5090 9.7551 4.7332 1.4479 1.3480 1.6981 1.3468 1.5843 2.2519 2.0126 2.0335 1.7516 1.2476 1.9775 2.6057 2.2981 2.2821 2.0197 1.5017 5.4368 8.9305 1.3447 2.7522 2.4768 1.0465 2.7239 1.2109 2.6166 9.4226 8.8143 6.8213 7.0781 6.2666 12.8427 1.0365 1.0957 1.1013 1.0866 1.0912 1.0894 1.0970 1.0968 1.0957 1.0939
irintensity: 0.0667 0.8379 2.4792 0.2512 1.0016 0.0985 0.4831 1.3516 1.9121 0.1660 1.4532 1.8604 0.0128 1.3048 9.4594 0.0753 0.0741 10.8635 0.7787 1.7277 6.4686 26.5236 2.2662 0.0390 2.1565 28.8296 10.0110 0.9044 8.9000 33.5283 26.4990 28.3791 4.4589 32.8085 60.6410 72.4696 1.0322 20.3682 181.2089 42.1914 3.6060 0.8936 2.3223 0.1391 10.4962 5.5448 42.1924 15.7567 3.8297 4.8033 50.6597 17.6429 41.1332 14.9412 11.8221 10.9749 2.1563 47.5519 15.6036 18.6601 19.5340 13.0296 171.3814 29.4462 15.5936 496.9487 183.6438 43.2325 115.3859 8.7944 397.0106 18.4321 9.5722 33.2515 4.3182 18.9668 1.3139 32.0382 0.9081 9.2674 0.2009
temp: 298.150 k
press: 1.00000 atm
elementType: 17 8 8 7 6 6 6 6 6 6 6 6 6 6 6 6 6 6 6 1 1 1 1 1 1 1 1 1 1
symmnumber: 1
zpe: 549171.7 jmol-1
zpe.correction: 0.209168 hartree
zpe.thermalcorrener: 0.224725 hartree
zpe.thermalcorrenthalpy: 0.225670 hartree
zpe.thermalcorrgfe: 0.165016 hartree
zpe.sumelectzpe: -1241.570015 hartree
zpe.sumelectthermal: -1241.554458 hartree
zpe.sumelectthermalent: -1241.553514 hartree
zpe.sumelectthermalfe: -1241.614168 hartree
dipole: 0.9773 -2.3068 -0.0038
dipole: 2.5053
quadrupole: -97.5094 -122.4016 -119.4690
quadrupole: -8.1048 -0.0234 -0.0897
quadrupole: 15.6173 -9.2749 -6.3424 -8.1048 -0.0234 -0.0897
hfenergy: -1241.7791839 hartree
pointgroup: C01 [X(C15H10Cl1N1O2)]
dipole: -0.4944098 -0.5741428 0.6304125 debye
polarizability: 343.9149501|-5.7996827|131.1462285|24.9674498|-68.2306548|152.407017 unknown
InChI: InChI=1S/C15H10ClNO2/c1-9-4-2-3-5-11(9)14-17-13-8-10(16)6-7-12(13)15(18)19-14/h2-8H,1H3
charge 0 multiplicity 1
29 atoms
Cl 5.008456 -1.431405 2.086387
O  -0.362727 1.120504 -1.230822
O  1.257985 2.244339 -2.422104
N  0.142234 -0.404262 0.566297
C  -2.203165 0.046864 -0.110668
C  -2.832737 -0.826252 0.844827
C  -0.738777 0.206732 -0.199042
C  1.510303 -0.153963 0.368997
C  1.987707 0.746167 -0.638972
C  -3.009326 0.797713 -1.019583
C  1.024146 1.438947 -1.505933
C  -4.249746 -0.897929 0.833881
C  2.445596 -0.821363 1.204437
C  3.379071 0.967823 -0.799891
C  -2.086017 -1.672854 1.856523
C  -4.410801 0.703015 -1.002926
C  -5.037597 -0.152108 -0.068214
C  3.812652 -0.578929 1.018375
C  4.303427 0.308097 0.026947
H  -2.511947 1.454739 -1.736625
H  -4.740721 -1.560231 1.556102
H  2.076676 -1.50649 1.970925
H  3.716322 1.660292 -1.577386
H  -1.384738 -2.369329 1.365197
H  -1.461662 -1.053949 2.523775
H  -2.799761 -2.2527 2.46691
H  -5.007645 1.288495 -1.709712
H  -6.129567 -0.238479 -0.041189
H  5.378658 0.469815 -0.085215
