program: Gaussian 09
title: 000292858
version: EM64L-G09RevD.01
frameworkgroup: C1[X(C8H9ClO)]
method: RPBEPBE
basis: SDD
operation: Freq
keyword: #p
keyword: freq=noraman
keyword: PBEPBE/SDD
title: #p freq=noraman PBEPBE/SDD
converged: NO YES NO NO
title: Mulliken charges:
elementType: Cl O C C C C C C C C H H H H H H H H H
charge: -0.074799 -0.269284 0.343086 0.219680 -0.372125 -0.309069 -0.780742 -0.259238 -0.107521 -0.536914 0.237292 0.266119 0.240005 0.214195 0.240072 0.253954 0.246552 0.224370 0.224368
chargesum: 0.00000
title: Mulliken charges with hydrogens summed into heavy atoms:
elementType: Cl O C C C C C C C C
charge: -0.074799 -0.269284 0.343086 0.219680 -0.134833 -0.042950 -0.086470 -0.005285 -0.107521 0.158375
polarizability: 1.34593466e+02 -6.43109125e-01 1.10955472e+02 5.81113618e-03 -1.24190406e-03 4.86505117e+01
1716.lowfreq: -7.6710 -6.7721 -0.0042 -0.0040 -0.0036 7.6408 96.1022 117.3623 134.6944
frequency: 96.0990 117.3599 134.6809 168.9464 187.9002 246.3309 260.2272 312.8251 334.4378 356.3974 446.6717 500.1010 509.0776 575.8722 631.0938 707.7601 747.9269 804.8734 834.3538 838.4935 936.8273 986.5406 991.0938 1047.4992 1082.8768 1113.1916 1129.4291 1154.3794 1189.2426 1231.5618 1274.9373 1381.1490 1383.3389 1401.3231 1440.0164 1457.4073 1468.1318 1469.6545 1474.6067 1486.5611 1585.9441 1605.0801 2960.1130 2982.8539 3048.8293 3061.7912 3091.1613 3127.5037 3134.6565 3175.1564 3179.8621
redmass: 2.6436 4.1782 1.1102 4.6819 2.0492 3.3598 1.5378 3.8135 3.8171 9.7546 2.8834 4.6091 4.3539 4.9135 6.8564 2.9899 4.6112 1.2699 6.4265 1.5452 1.3307 2.5570 2.5006 1.5182 2.1236 1.2613 1.5640 1.4243 2.5513 2.6531 1.4474 3.7823 3.5095 1.3336 1.2312 1.0453 1.0494 1.2255 1.1233 2.0304 8.3354 6.4086 1.0330 1.0363 1.1041 1.0969 1.1004 1.0994 1.0898 1.0951 1.0921
irintensity: 3.8278 3.8680 1.1979 3.0730 1.2234 1.2298 0.3115 0.5171 0.6786 6.8295 7.0307 0.6001 3.7650 8.3319 11.6651 0.3986 7.7052 33.6568 63.9774 39.5589 0.0134 20.1306 46.8769 7.1922 12.0444 0.1486 43.5861 0.5980 39.8409 76.8285 9.0525 7.7437 26.4513 20.2058 20.6692 12.5491 13.8695 80.2216 20.3283 67.1544 24.4077 73.6933 57.9188 28.6454 43.7071 18.3855 19.7955 20.8016 13.6452 4.2295 0.5151
temp: 298.150 k
press: 1.00000 atm
elementType: 17 8 6 6 6 6 6 6 6 6 1 1 1 1 1 1 1 1 1
symmnumber: 1
zpe: 387973.8 jmol-1
zpe.correction: 0.147771 hartree
zpe.thermalcorrener: 0.157811 hartree
zpe.thermalcorrenthalpy: 0.158755 hartree
zpe.thermalcorrgfe: 0.112218 hartree
zpe.sumelectzpe: -844.780812 hartree
zpe.sumelectthermal: -844.770773 hartree
zpe.sumelectthermalent: -844.769829 hartree
zpe.sumelectthermalfe: -844.816365 hartree
dipole: 2.0611 0.8320 0.0000
dipole: 2.2227
quadrupole: -69.9813 -53.4389 -69.0731
quadrupole: 3.7030 0.0002 -0.0011
quadrupole: -5.8168 10.7255 -4.9087 3.7030 0.0002 -0.0011
hfenergy: -844.9285839 hartree
pointgroup: C01 [X(C8H9Cl1O1)]
dipole: 0.8493607 0.2081153 0.0005321 debye
dipolederiv: -0.7195111 0.264976 -0.0003966 0.3297578 -0.3029336 0.0002044 -0.0003768 0.0001668 -0.0816902 -1.0180582 -0.6803764 -0.0004308 -0.5816811 -0.9576142 -0.0003505 -0.0006018 -0.0004738 -0.2902177 0.1130656 -0.2126029 0.000201 -0.417417 -0.1587705 -0.0003431 0.0005974 -0.0004927 -0.0597643 0.9510815 0.7447674 0.0006013 0.5435047 0.4723903 0.0003976 0.0006989 0.0005864 0.086763 0.1670026 0.0374314 0.0001961 0.0414772 0.1031948 0.0000021 0.0001347 0.0000258 -0.1597398 -0.512961 -0.1541289 -0.0001988 0.1704666 -0.1389269 0.0000635 -0.0002538 -0.0000938 -0.1749464 -0.1417569 0.0783284 -0.0000985 0.0296167 0.1105983 0.0002148 -0.0006767 0.0006319 0.0680806 -0.3234469 0.1145503 -0.0000877 0.2114959 -0.2442919 0.0001588 -0.0001255 0.000104 -0.1450695 1.0142266 -0.28898 0.0006207 -0.5019134 0.5267543 -0.0002917 0.0006526 -0.0001604 -0.0579863 0.2428873 0.0468424 -0.0000707 0.3393535 0.7603399 0.0001909 -0.0000542 -0.0000178 0.3229656 0.0692687 0.0344455 -0.0000173 0.0167683 -0.1146658 -0.0000039 -0.0000201 -0.0000512 0.1518312 0.1120194 0.0035086 -0.000033 -0.0032007 -0.044846 -0.0000047 -0.0000374 -0.0000153 0.1740872 -0.0075887 0.0262746 -0.0836226 0.0002165 0.0769969 -0.0669355 -0.121425 -0.0172998 -0.037352 0.0697807 -0.0803941 -0.0002641 0.0319811 -0.1632254 -0.0006938 0.000089 -0.0007625 0.1067781 -0.00799 0.0255313 0.0836981 -0.0008944 0.0767287 0.0675506 0.121451 0.0178479 -0.0358574 -0.0223265 -0.0644149 -0.0001248 -0.0597725 0.0634031 -0.000049 -0.0001273 -0.0000703 0.1791129 -0.1169462 -0.105746 -0.0001427 -0.0539637 0.0496879 -0.0000285 -0.0001398 -0.0000562 0.1224987 0.0655159 0.1050734 0.1117768 -0.047853 -0.0574317 -0.0422322 0.0636476 -0.0885383 -0.0846103 0.0657372 0.104914 -0.1116062 -0.0479423 -0.0573881 0.0421501 -0.0634328 0.0886693 -0.0848835 unknown
polarizability: 133.9290027|-3.9595157|111.6198965|0.0580561|-0.0044249|48.6505508 unknown
InChI: InChI=1S/C8H9ClO/c1-6-3-4-7(9)5-8(6)10-2/h3-5H,1-2H3
charge 0 multiplicity 1
19 atoms
Cl -3.326127 1.118401 -0.001892
O  1.940175 0.92717 0.001454
C  0.746778 -1.141359 0.000527
C  0.691204 0.285195 0.000562
C  -0.477833 -1.842775 -0.00026
C  -0.544195 0.976676 -0.000202
C  2.084974 -1.849042 0.001436
C  -1.731533 -1.182323 -0.000974
C  -1.732111 0.220778 -0.000938
C  1.958012 2.392769 0.001215
H  -0.457333 -2.938719 -0.000359
H  -0.594424 2.067948 -0.000215
H  2.682975 -1.568509 0.887963
H  1.952098 -2.944363 -0.001788
H  2.686772 -1.563537 -0.880864
H  -2.667771 -1.746738 -0.001589
H  3.023235 2.665783 0.001867
H  1.466466 2.800972 0.905899
H  1.467636 2.800671 -0.90424
