program: Gaussian 09
title: 000292886
version: EM64L-G09RevD.01
frameworkgroup: C1[X(C17H20N2O)]
method: RPBEPBE
basis: SDD
operation: Freq
keyword: #p
keyword: freq=noraman
keyword: PBEPBE/SDD
title: #p freq=noraman PBEPBE/SDD
converged: YES YES NO NO
title: Mulliken charges:
elementType: O N N C C C C C C C C C C C C C C C C C H H H H H H H H H H H H H H H H H H H H
charge: -0.275260 -0.108969 -0.003268 -0.401364 -0.394654 -0.382308 -0.376848 -0.366819 0.181424 -0.378360 0.193611 0.427781 0.183943 -0.453631 -0.377163 -0.382302 -0.441298 -0.260195 -0.255631 -0.520986 0.196643 0.220583 0.207186 0.202352 0.202031 0.204889 0.218827 0.211219 0.201737 0.242563 0.192151 0.237748 0.218086 0.250579 0.238218 0.221865 0.226185 0.224990 0.214116 0.260329
chargesum: 0.00000
title: Mulliken charges with hydrogens summed into heavy atoms:
elementType: O N N C C C C C C C C C C C C C C C C C
charge: -0.275260 -0.108969 -0.003268 0.015861 0.014884 0.024612 0.053199 0.077481 0.181424 -0.186209 0.193611 0.427781 0.183943 -0.215883 -0.159077 -0.131723 -0.203080 -0.038330 -0.029446 0.178449
polarizability: 3.23661569e+02 -1.40505693e+01 2.36341167e+02 -6.52396345e+00 -5.37783246e+00 1.17150115e+02
1716.lowfreq: -7.4164 -4.2451 -0.0007 -0.0007 -0.0003 6.0933 32.2281 33.6925 41.6711
frequency: 31.3964 33.2445 41.5276 84.4898 93.1122 116.6980 138.5320 160.0165 184.5875 194.9590 215.8988 229.8699 246.2867 284.3853 326.9474 337.4375 347.9320 383.7493 403.3719 423.4413 440.9249 444.0459 455.6485 512.3812 530.3987 546.7583 547.5890 579.4511 639.2816 667.4299 683.8975 724.3174 754.2146 775.7714 794.9653 806.5353 825.4983 843.5828 850.3290 862.3267 869.7990 878.9647 895.6355 922.8533 949.0647 952.8011 969.4317 976.7068 984.7629 998.2707 1038.4822 1046.1220 1070.1978 1081.3879 1092.7019 1102.4216 1125.9169 1145.4574 1149.6463 1153.2089 1159.1671 1173.8693 1206.4081 1223.4228 1233.8177 1249.8129 1258.0342 1268.0699 1271.5377 1289.9542 1312.4345 1331.1361 1342.6871 1347.1954 1353.2770 1362.8892 1384.2708 1401.9724 1408.8949 1424.1514 1431.3711 1446.9733 1456.6034 1459.3322 1461.8511 1464.8420 1468.9066 1474.3716 1480.7439 1511.9762 1553.1955 1569.7090 1604.5781 1624.6275 2890.7266 2908.5290 2973.1364 2975.0571 2987.4011 2988.8374 3026.8241 3041.3225 3042.0657 3049.0847 3057.5241 3075.5296 3082.0120 3107.3286 3118.2276 3128.4864 3130.6677 3150.3012 3163.9559 3167.9527
redmass: 3.3916 3.6164 4.0442 3.3936 4.4583 2.7610 3.8390 3.2181 1.6370 2.5471 4.0722 1.9918 2.3245 3.0701 4.7383 4.1663 1.6629 5.2823 4.0871 4.0853 3.2718 3.3489 3.9302 3.8410 3.9449 3.6136 3.0117 3.3008 5.1282 4.4690 4.2566 4.3240 1.3193 3.3689 2.0486 2.1751 1.4970 1.7543 2.1733 1.7678 2.5575 2.0613 4.7769 2.2922 1.3539 1.3092 1.3694 3.9035 1.3505 4.2937 2.2259 2.0510 2.3514 1.9457 1.4882 1.2492 2.2640 1.5807 1.4952 1.2678 1.7191 1.1374 1.7849 2.4786 2.3687 1.9208 1.2989 1.3952 1.6668 1.3894 2.5315 1.2993 1.4072 1.5212 1.5116 1.5413 1.7757 2.4853 2.1992 3.2322 1.9286 1.0957 1.0908 1.9110 1.1253 1.0827 1.0871 1.0648 1.0859 3.6538 6.0274 7.3310 6.2864 6.5334 1.0695 1.0712 1.0635 1.0307 1.0620 1.0611 1.0891 1.0956 1.0846 1.1025 1.1030 1.0912 1.1010 1.1046 1.0860 1.0888 1.0886 1.0938 1.0990 1.0960
irintensity: 0.0163 0.7251 0.0930 2.9219 0.1475 2.0851 1.1295 0.4992 2.0260 7.3365 7.8135 0.3639 10.1484 3.6541 8.2490 0.5661 8.9617 7.9855 11.8299 8.2670 2.0648 3.3090 6.5651 0.9277 1.4025 1.8482 9.6635 8.4347 11.3776 4.1476 17.5938 2.3903 46.3040 7.7505 2.8019 3.5225 64.0041 9.0274 19.2178 18.5970 5.6586 15.8287 14.1608 7.3283 1.9405 3.1921 0.9645 102.8781 0.6261 37.1558 2.8878 4.2835 67.1013 47.1561 35.1780 2.5478 6.9397 3.1809 12.3366 4.2749 7.6071 11.0160 56.8151 99.3551 22.0788 4.6704 14.2626 8.9383 18.2708 3.6273 16.8067 1.4497 0.1964 5.1728 47.7750 40.2649 1.1152 11.2705 32.0337 0.4139 36.8499 12.3430 7.5963 32.4590 41.9049 19.7669 4.7272 12.8755 17.1505 22.2828 61.9607 19.1112 15.1428 21.5871 40.3152 95.6417 39.2365 68.3933 31.7708 35.6230 22.7558 53.2853 71.0156 27.5153 75.9338 20.3029 30.6739 24.0441 3.2424 3.8923 13.0074 41.7901 35.1597 12.4576
temp: 298.150 k
press: 1.00000 atm
elementType: 8 7 7 6 6 6 6 6 6 6 6 6 6 6 6 6 6 6 6 6 1 1 1 1 1 1 1 1 1 1 1 1 1 1 1 1 1 1 1 1
symmnumber: 1
zpe: 873537.8 jmol-1
zpe.correction: 0.332713 hartree
zpe.thermalcorrener: 0.350719 hartree
zpe.thermalcorrenthalpy: 0.351663 hartree
zpe.thermalcorrgfe: 0.285989 hartree
zpe.sumelectzpe: -843.023159 hartree
zpe.sumelectthermal: -843.005153 hartree
zpe.sumelectthermalent: -843.004209 hartree
zpe.sumelectthermalfe: -843.069883 hartree
dipole: -3.3444 -1.9147 1.4056
dipole: 4.1020
quadrupole: -99.8435 -113.6979 -121.0259
quadrupole: 2.0002 -1.8085 1.5843
quadrupole: 11.6789 -2.1755 -9.5035 2.0002 -1.8085 1.5843
hfenergy: -843.355872 hartree
pointgroup: C01 [X(C17H20N2O1)]
dipole: 1.2691832 0.8874785 0.4540135 debye
polarizability: 322.7825222|-8.8594571|232.9347427|20.1115858|-18.9238887|121.435587 unknown
InChI: InChI=1S/C17H20N2O/c1-20-17-10-9-14-7-3-4-8-15(14)16(17)13-18-19-11-5-2-6-12-19/h3-4,7-10,13H,2,5-6,11-12H2,1H3
charge 0 multiplicity 1
40 atoms
O  -0.371629 -2.92342 0.760274
N  2.74521 -0.001824 0.068329
N  1.475217 -0.53489 -0.103391
C  5.425729 1.144985 -0.14201
C  4.432675 1.616594 0.942609
C  5.157596 -0.338618 -0.481445
C  2.963926 1.394316 0.516929
C  3.699558 -0.532482 -0.935766
C  -0.947737 -0.51561 0.215854
C  0.396271 0.080975 0.35503
C  -2.055125 0.377779 -0.120803
C  -3.386153 -0.152133 -0.341035
C  -1.235189 -1.8994 0.347099
C  -3.593967 -1.569202 -0.263448
C  -1.879586 1.795235 -0.284257
C  -2.545505 -2.4136 0.067364
C  -4.467971 0.730611 -0.657444
C  -2.953361 2.637495 -0.593592
C  -4.266227 2.107657 -0.774104
C  0.699568 -2.680909 1.735002
H  5.302694 1.762097 -1.056047
H  6.466371 1.285206 0.2050
H  4.621346 1.053285 1.877204
H  4.575801 2.690083 1.170019
H  5.83341 -0.688459 -1.284331
H  5.350146 -0.963393 0.412635
H  2.306746 1.597975 1.382225
H  2.681435 2.110096 -0.2926
H  3.544585 -0.020201 -1.914265
H  3.450041 -1.596491 -1.079266
H  0.440111 1.076637 0.824503
H  -4.59461 -1.974797 -0.452135
H  -0.882445 2.234842 -0.188713
H  -2.682662 -3.494781 0.164185
H  -5.465016 0.300412 -0.81243
H  -2.783041 3.714136 -0.708335
H  -5.100153 2.77581 -1.014773
H  0.842691 -3.649054 2.241913
H  0.403595 -1.90793 2.46932
H  1.621154 -2.363628 1.221195
